patent_number,grant_year,application_number,application_year,d_inventor,d_assignee,d_location,d_application,d_ipc,assignee,assignee_ind,country,city,state,county,ipc_section,team_size,inventors,men_inventors,women_inventors,inventor_id1,male_flag1,inventor_name1,inventor_id2,male_flag2,inventor_name2,inventor_id3,male_flag3,inventor_name3,inventor_id4,male_flag4,inventor_name4,inventor_id5,male_flag5,inventor_name5,inventor_id6,male_flag6,inventor_name6,inventor_id7,male_flag7,inventor_name7,inventor_id8,male_flag8,inventor_name8,inventor_id9,male_flag9,inventor_name9,assignee_sequence
3930273,1976,05/540240,1975,1,1,1,1,1,"AFFILIATED HOSPITAL PRODUCTS, INC.",0,US,Chesterfield,MO,St. Louis,A,1,1,0,1,fl:ro_ln:stern-10,0,Robert Stern,,,,,,,,,,,,,,,,,,,,,,,,,0
3930274,1976,05/513981,1974,1,0,0,1,1,,0,,,,,B,1,1,1,0,fl:ha_ln:syfritt-1,1,Harold A. Syfritt,,,,,,,,,,,,,,,,,,,,,,,,,
3930275,1976,05/563999,1975,1,0,0,1,1,,0,,,,,A,1,1,1,0,vh0qf4z9a38b1mbs93c88plj0,1,Richard Bailin,,,,,,,,,,,,,,,,,,,,,,,,,
3930276,1976,05/278258,1972,1,1,1,1,1,HAVERBERG AUTO LAUNDRY EQUIPMENT COMPANY,0,US,Chicago,IL,Cook County,B,1,1,1,0,fl:ru_ln:vanbrakel-2,1,Russell A. Van Brakel,,,,,,,,,,,,,,,,,,,,,,,,,0
3930277,1976,05/499143,1974,1,1,1,1,1,ADVANCE MACHINE COMPANY,0,US,Spring Park,MN,Hennepin,E,1,1,1,0,fl:ri_ln:wulff-2,1,Richard F. Wulff,,,,,,,,,,,,,,,,,,,,,,,,,0
3930278,1976,05/459696,1974,1,0,0,1,1,,0,,,,,A B,1,1,1,0,fl:ri_ln:nasca-1,1,Richard A. Nasca,,,,,,,,,,,,,,,,,,,,,,,,,
3930279,1976,05/484521,1974,1,0,0,1,1,,0,,,,,B,1,1,1,0,fl:da_ln:arman-1,1,Dario Arman,,,,,,,,,,,,,,,,,,,,,,,,,
3930280,1976,05/483694,1974,1,1,1,1,1,THE BRIDGEPORT METAL GOODS MANUFACTURING COMPANY,0,US,Bridgeport,CT,Fairfield,A,1,1,1,0,fl:ma_ln:vasas-1,1,Martin M. Vasas,,,,,,,,,,,,,,,,,,,,,,,,,0
3930281,1976,05/488981,1974,1,1,1,1,1,A. SUTTER AG,0,CH,Münchwilen,,,A,2,2,2,0,fl:re_ln:principe-1,1,Rene Principe,fl:ka_ln:kaser-1,1,Karl E. Kaser,,,,,,,,,,,,,,,,,,,,,,0
3930282,1976,05/507437,1974,1,1,1,1,1,"VICTOR F. WEAVER, INC.",0,US,New Holland,PA,Lancaster,A,2,2,2,0,fl:eu_ln:martin-7,1,Eugene G. Martin,fl:da_ln:risser-1,1,Dale M. Risser,,,,,,,,,,,,,,,,,,,,,,0
3930283,1976,05/514758,1974,1,1,1,1,1,"VICTOR F. WEAVER, INC.",0,US,New Holland,PA,Lancaster,A,1,1,1,0,fl:eu_ln:martin-7,1,Eugene G. Martin,,,,,,,,,,,,,,,,,,,,,,,,,0
3930284,1976,05/304386,1972,1,1,1,1,1,THE CINCINNATI MINE MACHINERY COMPANY,0,US,Cincinnati,OH,Hamilton,A,1,1,1,0,fl:fr_ln:cook-11,1,Frank M. Cook,,,,,,,,,,,,,,,,,,,,,,,,,0
3930285,1976,05/409054,1973,1,1,1,1,1,"ALFRED PROCTOR ALDRICH, JR.",1,US,Atlanta,GA,Fulton County,D,1,1,1,0,fl:wi_ln:wornall-1,1,William D. Wornall,,,,,,,,,,,,,,,,,,,,,,,,,0
3930286,1976,05/530877,1974,1,1,1,1,1,"UNITED VINTNERS, INC.",0,US,San Francisco,CA,San Francisco,B,1,1,0,1,fl:in_ln:mcgowen-1,0,Inez M. McGowen,,,,,,,,,,,,,,,,,,,,,,,,,0
3930287,1976,05/525821,1974,1,0,0,1,1,,0,,,,,B,4,3,3,0,fl:fr_ln:grise-1,1,Frederick G. J. Grise,fl:wa_ln:lovell-2,1,Walter C. Lovell,fl:ra_ln:heck-5,1,Ray E. Heck,fl:ka_ln:prescott-3,,Kalman Prescott,,,,,,,,,,,,,,,,
3930288,1976,05/480377,1974,1,1,1,1,1,POLI-TWINE CORPORATION LIMITED,0,CA,Saskatoon,SK,,F,2,2,2,0,fl:al_ln:black-4,1,Allan Black,fl:ra_ln:somerville-3,1,Ralph Somerville,,,,,,,,,,,,,,,,,,,,,,0
3930289,1976,05/515051,1974,1,0,0,1,1,,0,,,,,A,1,1,1,0,8kp91bwanmpnkxblp3sdyy92o,1,John W. Singular,,,,,,,,,,,,,,,,,,,,,,,,,
3930290,1976,05/526325,1974,1,0,0,1,1,,0,,,,,A B F,1,1,1,0,hloyk05neue9f9wyrn4307jko,1,Theodore F. Mangels,,,,,,,,,,,,,,,,,,,,,,,,,
3930291,1976,05/466982,1974,1,1,1,1,1,"ABBOTT MACHINE CO., INC.",0,US,Wilton,NH,Hillsborough,D,1,1,1,0,fl:sa_ln:abbott-2,1,Samuel Abbott,,,,,,,,,,,,,,,,,,,,,,,,,0
3930292,1976,05/546600,1975,1,1,0,1,1,BARMAG AG,0,,,,,D,2,2,2,0,fl:he_ln:schippers-1,1,Heinz Schippers,fl:er_ln:lenk-2,1,Erich Lenk,,,,,,,,,,,,,,,,,,,,,,0
3930293,1976,05/483814,1974,1,0,0,1,1,,0,,,,,D,1,1,1,0,fl:he_ln:girard-4,1,Herbert A. Girard,,,,,,,,,,,,,,,,,,,,,,,,,
3930294,1976,05/543970,1975,1,1,1,1,1,"COGSDILL TOOL PRODUCTS, INC.",0,US,Farmington,MI,Oakland,B,1,1,1,0,f8asfp2ro09tl7vlcgwuwkdhh,1,Stuart E. Kalen,,,,,,,,,,,,,,,,,,,,,,,,,0
3930295,1976,05/447981,1974,1,1,1,1,1,SIGNETICS CORPORATION,0,US,Sunnyvale,CA,Santa Clara,B,1,1,1,0,fl:ra_ln:rose-8,1,Ralph E. Rose,,,,,,,,,,,,,,,,,,,,,,,,,0
3930296,1976,05/491994,1974,1,1,1,1,1,GAF CORPORATION,0,US,New York,NY,New York County,B,1,1,1,0,fl:ja_ln:hoover-5,1,James Hoover,,,,,,,,,,,,,,,,,,,,,,,,,0
3930297,1976,05/412684,1973,1,1,1,1,1,DUO-FAST CORPORATION,0,US,Franklin Park,IL,Cook,B,2,2,2,0,fl:fr_ln:potucek-1,1,Frank R. Potucek,fl:al_ln:obergfell-1,1,Allen R. Obergfell,,,,,,,,,,,,,,,,,,,,,,0
3930298,1976,05/554971,1975,1,1,1,1,1,UNIVERSAL REFRIGERATION INC.,0,US,Mansfield,OH,Richland,B,1,1,1,0,fl:ra_ln:ridenour-1,1,Ralph G. Ridenour,,,,,,,,,,,,,,,,,,,,,,,,,0
3930299,1976,05/416675,1973,1,1,1,1,1,"AUTOMATED BUILDING COMPONENTS, INC.",0,NZ,Auckland,,,B,2,2,2,0,11a58bc7e376hfwed3ctekotw,1,Lee Charles Farrington,32ypsm9t3j50p3ntzvules350,1,Edgar Edward Dagley,,,,,,,,,,,,,,,,,,,,,,0
3930300,1976,05/347681,1973,1,1,1,1,1,HARRIS CORPORATION,0,US,Cleveland,OH,Cuyahoga,B H,1,1,1,0,fl:hu_ln:nicolay-1,1,Hugh C. Nicolay,,,,,,,,,,,,,,,,,,,,,,,,,0
3930301,1976,05/342697,1973,1,1,0,1,1,SCHIESS AKTIENGESELLSCHAFT,0,,,,,B,1,1,1,0,fl:ha_ln:wagner-12,1,Hans Wagner,,,,,,,,,,,,,,,,,,,,,,,,,0
3930302,1976,05/539513,1975,1,1,0,1,1,"TOYODA MACHINE WORKS, LTD.",0,,,,,B,3,3,3,0,fl:yo_ln:ochiai-8,1,Yoshiki Ochiai,fl:ak_ln:tsuboi-4,1,Akira Tsuboi,fl:yo_ln:kamiya-15,1,Yoji Kamiya,,,,,,,,,,,,,,,,,,,0
3930303,1976,05/543742,1975,1,1,1,1,1,COMPAGNIE INDUSTRIELLE DES TELECOMMUNICATIONS CIT-ALCATEL,0,FR,Paris,,,B,2,2,2,0,fl:mi_ln:alais-1,1,Michel Alais,fl:an_ln:stahl-4,1,Andre Stahl,,,,,,,,,,,,,,,,,,,,,,0
3930304,1976,05/416216,1973,1,1,0,1,1,ROBERT BOSCH G.M.B.H.,0,,,,,B,2,2,2,0,fl:he_ln:keller-9,1,Helmut Keller,fl:ha_ln:seiler-5,1,Hartmut Seiler,,,,,,,,,,,,,,,,,,,,,,0
3930305,1976,05/368460,1973,1,1,1,1,1,COMMISSARIAT A L'ENERGIE ATOMIQUE,0,FR,Paris,,,B,3,3,3,0,fl:ja_ln:lacour-1,1,Jacques Lacour,fl:mi_ln:montier-1,1,Michel Montier,sbu1s4emwx3cf3n8wvxbjnxve,1,Jean-Pierre Suat,,,,,,,,,,,,,,,,,,,0
3930306,1976,05/463678,1974,1,1,1,1,1,GENERAL INSTRUMENT CORPORATION,0,US,Clifton,NJ,Passaic,B,2,2,1,1,fl:mo_ln:goldberg-5,0,Monroe B. Goldberg,fl:wi_ln:voorhis-1,1,William B. Voorhis,,,,,,,,,,,,,,,,,,,,,,0
3930307,1976,05/484530,1974,1,1,1,1,1,ALLIED CORPORATION,0,US,New York,NY,New York County,H,2,2,2,0,fl:je_ln:schotthoefer-1,1,Jerome W. Schotthoefer,fl:do_ln:lewis-12,1,Donald J. Lewis,,,,,,,,,,,,,,,,,,,,,,0
3930308,1976,05/502996,1974,1,1,1,1,1,AMP INCORPORATED,0,US,Harrisburg,PA,Dauphin,H,1,1,1,0,fl:ge_ln:munro-2,1,Geoffrey Hector James Munro,,,,,,,,,,,,,,,,,,,,,,,,,0
3930309,1976,05/474389,1974,1,0,0,1,1,,0,,,,,B,1,1,1,0,fl:wa_ln:collins-1,1,Walter W. Collins,,,,,,,,,,,,,,,,,,,,,,,,,
3930310,1976,05/446499,1974,1,0,0,1,1,,0,,,,,B,1,1,1,0,fl:er_ln:santilli-2,1,Ermanno Santilli,,,,,,,,,,,,,,,,,,,,,,,,,
3930311,1976,05/426487,1973,1,0,0,1,1,,0,,,,,A,1,1,1,0,fl:la_ln:andrews-4,1,Lawrence F. Andrews,,,,,,,,,,,,,,,,,,,,,,,,,
3930312,1976,05/434205,1974,1,0,0,1,1,,0,,,,,A,1,1,1,0,fl:ha_ln:daub-2,1,Hans Werner Daub,,,,,,,,,,,,,,,,,,,,,,,,,
3930313,1976,05/498870,1974,1,0,0,1,1,,0,,,,,B,1,1,1,0,a6oqtma8yapnbcz3tanstdszs,1,Lucien Emile Sautereau,,,,,,,,,,,,,,,,,,,,,,,,,
3930314,1976,05/399978,1973,1,0,0,1,1,,0,,,,,B,1,1,1,0,fl:an_ln:iwanicki-1,1,Andrzej T. Iwanicki,,,,,,,,,,,,,,,,,,,,,,,,,
3930315,1976,05/486443,1974,1,0,0,1,1,,0,,,,,B E,1,1,1,0,ngu32n0nxpc5y3h5htwukrmpq,1,John L. Baskett,,,,,,,,,,,,,,,,,,,,,,,,,
3930316,1976,05/470838,1974,1,1,1,1,1,ETAT FRANCAIS,0,FR,,,,F,1,1,1,0,fl:pa_ln:tellie-1,1,Paul E. Tellie,,,,,,,,,,,,,,,,,,,,,,,,,0
3930317,1976,05/468724,1974,1,1,1,1,1,THE UNITED STATES OF AMERICA AS REPRESENTED BY THE SECRETARY OF THE ARMY,0,US,Washington,DC,District of Columbia,G,1,1,1,0,fl:ja_ln:johnston-25,1,James Johnston,,,,,,,,,,,,,,,,,,,,,,,,,0
3930318,1976,05/353855,1973,1,1,1,1,1,"CONTINENTAL CAN COMPANY, INC.",0,US,New York,NY,New York County,F,3,3,3,0,fl:ro_ln:stelter-1,1,Ronald B. Stelter,fl:ra_ln:kulka-2,1,Raymond P. Kulka,amu5nt4slvybof6fvex5gjfw6,1,Paul J. Kmetty,,,,,,,,,,,,,,,,,,,0
3930319,1976,05/529583,1974,1,1,1,1,1,COMMONWEALTH SCIENTIFIC AND INDUSTRIAL RESEARCH ORGANISATION,0,AU,North Canberra,,,F,1,0,0,0,fl:jo_ln:coleman-23,,John D. Coleman,,,,,,,,,,,,,,,,,,,,,,,,,0
3930320,1976,05/528873,1974,1,0,0,1,1,,0,,,,,F,1,1,1,0,fl:bu_ln:henderson-1,1,Burnis Henderson,,,,,,,,,,,,,,,,,,,,,,,,,
3930321,1976,05/548831,1975,1,0,0,1,1,,0,,,,,A G,2,2,2,0,fl:ad_ln:goldfarb-3,1,Adolph E. Goldfarb,fl:er_ln:benkoe-1,1,Erwin Benkoe,,,,,,,,,,,,,,,,,,,,,,
3930322,1976,05/568146,1975,1,0,0,1,1,,0,,,,,A,3,2,2,0,fl:ic_ln:endo-2,,Ichitaro Endo,fl:ke_ln:tamano-2,1,Kenichi Tamano,fl:ta_ln:sato-64,1,Tadashi Sato,,,,,,,,,,,,,,,,,,,
3930323,1976,05/527956,1974,1,1,1,1,1,GENERAL MOTORS CORPORATION,0,US,Detroit,MI,Wayne,B,2,2,2,0,fl:fr_ln:marold-1,1,Frank Marold,fk28pykwl7yts97pshtxqabnf,1,James J. Cinadr,,,,,,,,,,,,,,,,,,,,,,0
3930324,1976,05/467481,1974,1,1,0,1,1,BRITISH GAS CORPORATION,0,,,,,E,3,3,3,0,fl:da_ln:wightman-2,1,David Douglas Wightman,fl:ed_ln:ward-1,1,Edward Anthony Ward,fl:ti_ln:miller-22,1,Timothy J. Miller,,,,,,,,,,,,,,,,,,,0
3930325,1976,05/491463,1974,1,1,1,1,1,GENERAL ELECTRIC COMPANY,0,US,Bridgeport,CT,Fairfield,D,2,2,2,0,fl:ro_ln:schaeffer-4,1,Robert L. Schaeffer,fl:ka_ln:toft-1,1,Kaj Toft,,,,,,,,,,,,,,,,,,,,,,0
3930326,1976,05/479375,1974,1,0,0,1,1,,0,,,,,G,1,1,1,0,fl:an_ln:rosa-3,1,Anthony Rosa,,,,,,,,,,,,,,,,,,,,,,,,,
3930327,1976,05/521733,1974,1,1,1,1,1,BANNER BOARD COMPANY,0,US,Lancaster,PA,Lancaster,G,1,1,1,0,fl:st_ln:friedman-15,1,Stanley Jay Friedman,,,,,,,,,,,,,,,,,,,,,,,,,0
3930328,1976,05/379830,1973,1,0,0,1,1,,0,,,,,A,1,1,1,0,fl:eu_ln:knuth-1,1,Eugene W. Knuth,,,,,,,,,,,,,,,,,,,,,,,,,
3930329,1976,05/499631,1974,1,0,0,1,1,,0,,,,,A,1,1,1,0,fl:jo_ln:burkhardt-2,1,John B. Burkhardt,,,,,,,,,,,,,,,,,,,,,,,,,
3930330,1976,05/546100,1975,1,0,0,1,1,,0,,,,,A,1,1,0,1,fl:al_ln:black-6,0,Albert David Black,,,,,,,,,,,,,,,,,,,,,,,,,
3930331,1976,05/442417,1974,1,0,0,1,1,,0,,,,,A,1,1,0,1,fl:ja_ln:simeone-2,0,Janet A. Simeone,,,,,,,,,,,,,,,,,,,,,,,,,
3930332,1976,05/439083,1974,1,1,0,1,1,MARKES & CO. KG.,0,,,,,A,1,1,1,0,fl:uw_ln:seefluth-1,1,Uwe C. Seefluth,,,,,,,,,,,,,,,,,,,,,,,,,0
3930333,1976,05/531949,1974,1,1,1,1,1,"MATTEL, INC.",0,US,Hawthorne,CA,Los Angeles,A,1,1,1,0,fl:ni_ln:deanda-1,1,Nicholas De Anda,,,,,,,,,,,,,,,,,,,,,,,,,0
3930334,1976,05/471661,1974,1,0,0,1,1,,0,,,,,A B F,1,1,1,0,fl:er_ln:johnston-11,1,Ervin Johnston,,,,,,,,,,,,,,,,,,,,,,,,,
3930335,1976,05/507152,1974,1,1,1,1,1,CONTROLLED ENVIRONMENTAL SYSTEMS CORPORATION,0,US,Rockville,MD,Montgomery,A,1,1,1,0,fl:do_ln:widmayer-1,1,Don F. Widmayer,,,,,,,,,,,,,,,,,,,,,,,,,0
3930336,1976,05/515099,1974,1,0,0,1,1,,0,,,,,E,1,1,1,0,fl:ni_ln:ruggieri-3,1,"Nicola Ruggieri, Jr.",,,,,,,,,,,,,,,,,,,,,,,,,
3930337,1976,05/558133,1975,1,1,1,1,1,AUTOMOBILES PEUGEOT,0,FR,Paris,,,E,2,2,2,0,8veykisaa7i0d0pu74k6gicxe,1,Marcel Quesnel,dplhgetwjjpqb0eli83py6k55,1,Bernard Julou,,,,,,,,,,,,,,,,,,,,,,1
3930338,1976,05/439430,1974,1,1,1,1,1,"ARELCO, INCORPORATED",0,US,Bridgeview,IL,Cook,E,1,1,1,0,fl:ro_ln:rood-2,1,Ronald A. Rood,,,,,,,,,,,,,,,,,,,,,,,,,0
3930339,1976,05/481395,1974,1,1,0,1,1,ROCKWELL-GOLDE G.M.B.H.,0,,,,,E,1,1,1,0,2fodnrxkd2wczrnanevbdjdro,1,Horst Jander,,,,,,,,,,,,,,,,,,,,,,,,,0
3930340,1976,05/496382,1974,1,0,0,1,1,,0,,,,,B,1,1,0,1,fl:al_ln:williams-75,0,Alsan Williams,,,,,,,,,,,,,,,,,,,,,,,,,
3930341,1976,05/438770,1974,1,0,0,1,1,,0,,,,,B,1,1,1,0,fl:ma_ln:neuman-7,1,Marcel Neuman,,,,,,,,,,,,,,,,,,,,,,,,,
3930342,1976,05/456946,1974,1,1,1,1,1,THE BLACK AND DECKER MANUFACTURING COMPANY,0,US,Towson,MD,Baltimore County,B,2,2,2,0,fl:ro_ln:moores-1,1,"Robert G. Moores, Jr.",fl:ri_ln:walton-5,1,"Richard E. Walton, II",,,,,,,,,,,,,,,,,,,,,,0
3930343,1976,05/447684,1974,1,1,0,1,1,VEB RATHENOWER OPTISCHE WERKE,0,,,,,B,2,1,1,0,fl:de_ln:welsch-2,,Detlef Welsch,ylcdpo85jlj0lkcfx3hukdydf,1,Horst Waschull,,,,,,,,,,,,,,,,,,,,,,0
3930344,1976,05/428603,1973,1,1,1,1,1,"X. S. SMITH, INC.",0,US,Red Bank,NJ,Monmouth,E,1,1,1,0,vntf0mizm4zmun7dz4a4tsv8z,1,Charles C. Gahler,,,,,,,,,,,,,,,,,,,,,,,,,0
3930345,1976,05/545983,1975,1,0,0,1,1,,0,,,,,B E F,1,1,1,0,n69v528uctxj9rypatff4bxc8,1,Richard H. Kurzenberger,,,,,,,,,,,,,,,,,,,,,,,,,
3930346,1976,05/515679,1974,1,1,1,1,1,EUNICE JOESPHINE BLAKEWAY,1,AU,Stafford,,,F,1,1,1,0,fl:st_ln:blakeway-1,1,Stanley R. Blakeway,,,,,,,,,,,,,,,,,,,,,,,,,0
3930347,1976,05/420399,1973,1,1,0,1,1,NAOMITSU MEGUMI,1,,,,,E,1,0,0,0,fl:na_ln:megumi-1,,Naomitsu Megumi,,,,,,,,,,,,,,,,,,,,,,,,,0
3930348,1976,05/395778,1973,1,1,1,1,1,JOHNS MANVILLE,0,US,Denver,CO,Denver County,E,1,1,1,0,fl:ha_ln:wise-3,1,Harry Wise,,,,,,,,,,,,,,,,,,,,,,,,,0
3930349,1976,05/478229,1974,1,1,0,1,1,RHEINISCHE FILIGRANBAU GMBH & CO. KG,0,,,,,E,1,1,1,0,fl:ha_ln:wellershaus-2,1,Hartmut Wellershaus,,,,,,,,,,,,,,,,,,,,,,,,,0
3930350,1976,05/528291,1974,1,1,1,1,1,W. R. GRACE & CO.-CONN.,0,US,Duncan,SC,Spartanburg,B,1,1,1,0,fl:ph_ln:reid-6,1,Philip L. Reid,,,,,,,,,,,,,,,,,,,,,,,,,0
3930351,1976,05/491301,1974,1,1,0,1,1,DAIWA BOSEKI KABUSHIKI KAISHA,0,,,,,B,2,1,1,0,fl:sh_ln:ueda-13,,Shozo Ueda,fl:to_ln:taniguchi-31,1,Toshinori Taniguchi,,,,,,,,,,,,,,,,,,,,,,1
3930352,1976,05/462896,1974,1,1,1,1,1,AMF INCORPORATED,0,US,White Plains,NY,Westchester,B,1,1,1,0,fl:ro_ln:carnes-6,1,Roy W. Carnes,,,,,,,,,,,,,,,,,,,,,,,,,0
3930353,1976,05/465497,1974,1,1,0,1,1,ROBERT BOSCH G.M.B.H.,0,,,,,B,1,1,1,0,fl:ha_ln:beckers-1,1,Hans Beckers,,,,,,,,,,,,,,,,,,,,,,,,,0
3930354,1976,05/446109,1974,1,1,1,1,1,RIVIERRE CASALIS,0,FR,Fleury-les-Aubrais,,,A,1,1,1,0,ew8qov8yk931qnrgobdyz2v9g,1,Antoine Borderie,,,,,,,,,,,,,,,,,,,,,,,,,0
3930355,1976,05/520787,1974,1,0,0,1,1,,0,,,,,A,1,1,1,0,zmkioa73aptshlpqts7iixyyk,1,Herbert C. Bonham,,,,,,,,,,,,,,,,,,,,,,,,,
3930356,1976,05/204430,1971,1,1,1,1,1,HOYA CORPORATION,0,CH,Zürich,,,D,1,1,1,0,fl:er_ln:nagel-2,1,Ernst Nagel,,,,,,,,,,,,,,,,,,,,,,,,,0
3930357,1976,05/541528,1975,1,1,1,1,1,H. G. P. CORPORATION,0,US,Johnston,RI,Providence County,D,1,1,1,0,fl:ki_ln:gibson-4,1,Kirkland H. Gibson,,,,,,,,,,,,,,,,,,,,,,,,,0
3930358,1976,05/481636,1974,1,1,1,1,1,GENERAL ELECTRIC COMPANY,0,US,Bridgeport,CT,Fairfield,G,1,1,1,0,fl:ro_ln:boyles-1,1,Robert L. Boyles,,,,,,,,,,,,,,,,,,,,,,,,,0
3930359,1976,05/390118,1973,1,1,1,1,1,ROBERTSHAW CONTROLS COMPANY,0,US,Richmond,VA,Richmond city,G H,2,2,2,0,fl:pa_ln:flumm-1,1,Paul T. Flumm,fl:ve_ln:harris-1,1,Vernon B. Harris,,,,,,,,,,,,,,,,,,,,,,0
3930360,1976,05/481834,1974,1,1,1,1,1,GENERAL ELECTRIC COMPANY,0,US,Bridgeport,CT,Fairfield,G,1,1,1,0,fl:ro_ln:boyles-1,1,Robert L. Boyles,,,,,,,,,,,,,,,,,,,,,,,,,0
3930361,1976,05/515068,1974,1,1,0,1,1,"CITIZEN WATCH CO., LTD.",0,,,,,G,3,3,2,1,fl:mi_ln:saito-58,0,Mituo Saito,fl:go_ln:ishikawa-1,1,Goro Ishikawa,fl:hi_ln:tutiya-1,1,Hidetaka Tutiya,,,,,,,,,,,,,,,,,,,0
3930362,1976,05/557474,1975,1,1,1,1,1,GENERAL TIME CORPORATION,0,US,Mesa,AZ,Maricopa,F G,1,1,1,0,fl:ed_ln:cielaszyk-1,1,Edward F. Cielaszyk,,,,,,,,,,,,,,,,,,,,,,,,,0
3930363,1976,05/490221,1974,1,1,1,1,1,BURRELL R. RUBENSTEIN,1,US,Kansas City,MO,Jackson County,G,1,1,1,0,fl:bu_ln:rubenstein-1,1,Burrell R. Rubenstein,,,,,,,,,,,,,,,,,,,,,,,,,0
3930364,1976,05/490706,1974,1,1,1,1,1,UNIVERSAL MANUFACTURING CORPORATION,0,CN,Sha Tin,,,F,1,1,0,1,fl:kw_ln:wong-17,0,Kwong Hou WONG,,,,,,,,,,,,,,,,,,,,,,,,,0
3930365,1976,05/489742,1974,1,1,0,1,1,JOSEPH LUCAS (INDUSTRIES) LIMITED,0,,,,,F,1,1,1,0,fl:tr_ln:smith-8,1,Trevor S. Smith,,,,,,,,,,,,,,,,,,,,,,,,,0
3930366,1976,05/489263,1974,1,1,1,1,1,GENERAL MOTORS CORPORATION,0,US,Detroit,MI,Wayne,F,1,1,1,0,fl:ro_ln:nelson-31,1,Robert E. Nelson,,,,,,,,,,,,,,,,,,,,,,,,,0
3930367,1976,05/517259,1974,1,1,1,1,1,GENERAL ELECTRIC COMPANY,0,US,Salem,VA,Salem city,F,1,1,1,0,fl:ro_ln:gasparoli-1,1,Robert E. Gasparoli,,,,,,,,,,,,,,,,,,,,,,,,,0
3930368,1976,05/531875,1974,1,1,1,1,1,GENERAL MOTORS CORPORATION,0,US,Detroit,MI,Wayne,F,2,2,2,0,fl:ro_ln:anderson-83,1,Robert Anderson,fl:da_ln:hyden-1,1,Daniel Hyden,,,,,,,,,,,,,,,,,,,,,,0
3930369,1976,05/439646,1974,1,1,1,1,1,GENERAL MOTORS CORPORATION,0,US,Detroit,MI,Wayne,F,1,1,1,0,fl:al_ln:verdouw-1,1,Albert J. Verdouw,,,,,,,,,,,,,,,,,,,,,,,,,0
3930370,1976,05/478403,1974,1,1,1,1,1,UNITED TECHNOLOGIES CORPORATION,0,US,Hartford,CT,Hartford,F,2,2,2,0,fl:st_ln:markowski-1,1,Stanley J. Markowski,fl:ri_ln:reilly-2,1,Richard S. Reilly,,,,,,,,,,,,,,,,,,,,,,0
3930371,1976,05/394870,1973,1,1,0,1,1,SIEMENS AKTIENGESELLSCHAFT,0,,,,,F,1,1,1,0,fl:ha_ln:schabert-1,1,Hans-Peter Schabert,,,,,,,,,,,,,,,,,,,,,,,,,0
3930372,1976,05/419742,1973,1,1,1,1,1,JOHNS MANVILLE,0,US,Denver,CO,Denver County,E,1,1,0,1,fl:st_ln:norman-8,0,Stanley William Norman,,,,,,,,,,,,,,,,,,,,,,,,,0
3930373,1976,05/554704,1975,1,1,1,1,1,ROY ASSERBACK,1,ES,Marbella,,,E,1,1,1,0,fl:lo_ln:wahman-1,1,Lorentz Wahman,,,,,,,,,,,,,,,,,,,,,,,,,0
3930374,1976,05/556003,1975,1,0,0,1,1,,0,,,,,E,1,1,1,0,fl:ch_ln:hoppe-4,1,Charles W. Hoppe,,,,,,,,,,,,,,,,,,,,,,,,,
3930375,1976,05/418853,1973,1,1,0,1,1,LINDE AKTIENGESELLSCHAFT,0,,,,,F,1,1,1,0,fl:al_ln:hofmann-9,1,Albert Hofmann,,,,,,,,,,,,,,,,,,,,,,,,,0
3930376,1976,05/543291,1975,1,1,1,1,1,WHITE-WESTINGHOUSE CORPORATION,0,US,Cleveland,OH,Cuyahoga,F,1,1,1,0,fl:an_ln:schwartz-13,1,Anton J. Schwartz,,,,,,,,,,,,,,,,,,,,,,,,,0
3930377,1976,05/398538,1973,1,1,1,1,1,KING-SEELEY THERMOS CO.,0,US,Ann Arbor,MI,Washtenaw,F,1,1,1,0,fl:ro_ln:utter-3,1,Robert P. Utter,,,,,,,,,,,,,,,,,,,,,,,,,0
3930378,1976,05/503360,1974,1,0,0,1,1,,0,,,,,F,1,1,1,0,fl:le_ln:schmid-4,1,Leopold F. Schmid,,,,,,,,,,,,,,,,,,,,,,,,,
3930379,1976,05/467955,1974,1,1,0,1,1,MANNESMANN-MEER AKTIENGESELLSCHAFT,0,,,,,F,2,2,2,0,fl:he_ln:hiersig-1,1,Heinz M. Hiersig,fl:wi_ln:koster-5,1,Wilhelm Koster,,,,,,,,,,,,,,,,,,,,,,0
3930380,1976,05/498755,1974,1,1,1,1,1,GENERAL MOTORS CORPORATION,0,US,Detroit,MI,Wayne,F,1,1,1,0,fl:th_ln:fogt-1,1,Thomas H. Fogt,,,,,,,,,,,,,,,,,,,,,,,,,0
3930381,1976,05/436144,1974,1,1,1,1,1,"ENGINEERED INSERTS & SYSTEMS, INC.",0,US,Watertown,CT,Litchfield,F,2,1,1,0,fl:jo_ln:hall-26,,John T. Hall,fl:al_ln:alves-5,1,Alexander R. Alves,,,,,,,,,,,,,,,,,,,,,,0
3930382,1976,05/426086,1973,1,1,0,1,1,RINGSPANN GMBH,0,,,,,F,1,1,1,0,fl:ka_ln:timtner-1,1,Karlheinz Timtner,,,,,,,,,,,,,,,,,,,,,,,,,0
3930383,1976,05/284875,1972,1,1,0,1,1,FIRMA FOUQUET-WERKE FRAUZ & PLANCK,0,,,,,D,1,1,1,0,fl:ot_ln:nuber-1,1,Otto Nuber,,,,,,,,,,,,,,,,,,,,,,,,,0
3930384,1976,05/463666,1974,1,1,0,1,1,C. TERROT SOHNE,1,,,,,D,1,1,1,0,fl:al_ln:schindele-1,1,Alfred Schindele,,,,,,,,,,,,,,,,,,,,,,,,,0
3930385,1976,05/542544,1975,1,0,0,1,1,,0,,,,,D,1,1,1,0,fl:jo_ln:greczin-1,1,John Greczin,,,,,,,,,,,,,,,,,,,,,,,,,
3930386,1976,05/398393,1973,1,1,0,1,1,BENTLEY ENGINEERING COMPANY LIMITED,0,,,,,D,1,1,1,0,fl:fr_ln:keel-1,1,Frederick Keel,,,,,,,,,,,,,,,,,,,,,,,,,0
3930387,1976,05/406341,1973,1,1,0,1,1,"TOKYO SUN CO., LTD.",0,,,,,A D,1,1,1,0,fl:ko_ln:imamura-5,1,Koji Imamura,,,,,,,,,,,,,,,,,,,,,,,,,0
3930388,1976,05/498361,1974,1,0,0,1,1,,0,,,,,B,1,1,1,0,fl:pa_ln:barras-2,1,Paul E. Barras,,,,,,,,,,,,,,,,,,,,,,,,,
3930389,1976,05/552259,1975,1,0,0,1,1,,0,,,,,B E,1,1,1,0,c8vq7ajclm2peivgjwptrier0,1,Robert Buikus,,,,,,,,,,,,,,,,,,,,,,,,,
3930390,1976,05/501286,1974,1,0,0,1,1,,0,,,,,E,1,1,1,0,fl:er_ln:keller-14,1,Ernst Keller,,,,,,,,,,,,,,,,,,,,,,,,,
3930391,1976,05/558847,1975,1,1,1,1,1,GENERAL MOTORS CORPORATION,0,US,Detroit,MI,Wayne,E,1,1,1,0,fl:ha_ln:borlinghaus-1,1,Hans J. Borlinghaus,,,,,,,,,,,,,,,,,,,,,,,,,0
3930392,1976,05/569889,1975,1,1,1,1,1,PRUTTON CORPORATION,0,US,Cleveland,OH,Cuyahoga,B,1,1,1,0,fl:ro_ln:matej-1,1,Ronald J. Matej,,,,,,,,,,,,,,,,,,,,,,,,,0
3930393,1976,05/558166,1975,1,1,1,1,1,THOMAS & BETTS CORPORATION,0,US,Elizabeth,NJ,Union,H,1,1,1,0,fl:da_ln:eppler-1,1,Daniel Eppler,,,,,,,,,,,,,,,,,,,,,,,,,0
3930394,1976,05/490865,1974,1,0,0,1,1,,0,,,,,B,10,10,9,1,n7yzqvfwjeqzefg0u4o96ywmh,1,Pavel Ivanovich Orro,sndesab8irobpo7zmowhyvn9l,1,Nikolai Grigorievich Kovalevsky,fl:al_ln:lobanov-2,1,Alexandr Ivanovich Lobanov,kbfwba1ia49fr0lko5gg5hjyq,1,Andrei Mikhailovich Arkhangelsky,fl:va_ln:makarov-9,1,Valentin Anatolievich Makarov,0ya6wat3ypryjp4bkisl7sz4o,0,Jury Georgievich Goreslavets,fl:ni_ln:erokhov-1,1,Nikolai Konstantinovich Erokhov,fl:ge_ln:khaustov-1,1,Georgy I. Khaustov,nt8vpwmmoczmjelnlr3175xtx,1,Ivan Mikhailovich Obukh-Shvets,
3930395,1976,05/567606,1975,1,1,0,1,1,SMS SCHLOEMANN-SIEMAG AKTIENGESELLSCHAFT,0,,,,,B,3,2,2,0,fl:er_ln:bretschneider-2,1,Erich Bretschneider,fl:he_ln:leitner-2,1,Hermann Leitner,fl:fr_ln:bohmer-3,,Friedhlem Bohmer,,,,,,,,,,,,,,,,,,,0
3930396,1976,05/510386,1974,1,1,1,1,1,REYNOLDS METALS COMPANY,0,US,Richmond,VA,Richmond city,B,1,1,1,0,fl:ev_ln:martinez-4,1,Everly Martinez,,,,,,,,,,,,,,,,,,,,,,,,,0
3930397,1976,05/501454,1974,1,0,0,1,1,,0,,,,,G,1,1,1,0,fl:sh_ln:suga-17,1,Shigeru Suga,,,,,,,,,,,,,,,,,,,,,,,,,
3930398,1976,05/272624,1972,1,0,0,1,1,,0,,,,,G,3,3,2,1,fl:ta_ln:levina-1,0,Tatyana Abramovna Levina,fl:mi_ln:serkh-1,1,Mikhail B. Serkh,setcf2dicxvrhvzc7o0boghfb,1,Ivan Georgievich Guzynin,,,,,,,,,,,,,,,,,,,
3930399,1976,05/490534,1974,1,1,1,1,1,"VARIAN ASSOCIATES, INC.",0,US,Palo Alto,CA,Santa Clara,G,1,1,1,0,fl:mi_ln:munk-1,1,Miner N. Munk,,,,,,,,,,,,,,,,,,,,,,,,,0
3930400,1976,05/463759,1974,1,1,1,1,1,SOCIETE ANONYME DES USINES CHAUSSON,0,FR,Amilly,,,G,1,1,1,0,fl:al_ln:plegat-1,1,Alain Edouard Plegat,,,,,,,,,,,,,,,,,,,,,,,,,0
3930401,1976,05/355908,1973,1,0,0,1,1,,0,,,,,G,1,1,1,0,c8pqurirv0ltidc7l73tng7ja,1,Harry H. Filler,,,,,,,,,,,,,,,,,,,,,,,,,
3930402,1976,05/446261,1974,1,1,1,1,1,GIST-BROCADES N.V.,0,NL,Delft,,,G,4,4,4,0,agfrfgbcavm04c6552ejfev5g,1,Dirk Adrianus Detmar,fl:ja_ln:vandersluis-4,1,Jan Van der Sluis,gig21mjxgaeanjrnlmugguvyx,1,Izak Johannes Stolk,us29hyk8npsvcrpkm273nuo2c,1,Marius Hendrik Johan Zuidweg,,,,,,,,,,,,,,,,0
3930403,1976,05/491137,1974,1,1,0,1,1,IMPERIAL CHEMICAL INDUSTRIES PLC,0,,,,,G,4,4,4,0,fl:wi_ln:cross-3,1,William T. Cross,6ihxjf7mcvgiwetopy1n2yd3b,1,Stephen Alexander Gaydon,fl:an_ln:gilchrist-4,1,Andrew Gilchrist,fl:er_ln:ellis-4,1,Ernest Raymond Ellis,,,,,,,,,,,,,,,,0
3930404,1976,05/372202,1973,1,1,1,1,1,"EXXON NUCLEAR COMPANY, INC.",0,US,Bellevue,WA,King,G,1,1,1,0,fl:jo_ln:ryden-2,1,"Joseph Ryden, Jr.",,,,,,,,,,,,,,,,,,,,,,,,,0
3930405,1976,05/506819,1974,1,1,1,1,1,THE UNITED STATES OF AMERICA AS REPRESENTED BY THE ADMINISTRATOR OF THE NATIONAL AERONAUTICS AND SPACE ADMINISTRATION,0,US,Washington,DC,District of Columbia,G,1,1,1,0,p5boctrwg0gh8266sd7vsvrq5,1,"Claus J. Renken, Jr.",,,,,,,,,,,,,,,,,,,,,,,,,0
3930406,1976,05/503236,1974,1,1,1,1,1,AMF INCORPORATED,0,US,White Plains,NY,Westchester,G,1,1,1,0,fl:gi_ln:pezzi-1,1,Giovanni Pezzi,,,,,,,,,,,,,,,,,,,,,,,,,0
3930407,1976,05/431236,1974,1,0,0,1,1,,0,,,,,C G,1,1,1,0,fl:ja_ln:alburger-1,1,James R. Alburger,,,,,,,,,,,,,,,,,,,,,,,,,
3930408,1976,05/563969,1975,1,1,0,1,1,TOYOTA JIDOSHA KABUSHIKI KAISHA,0,,,,,G,1,1,1,0,fl:ma_ln:kadota-6,1,Masahiro Kadota,,,,,,,,,,,,,,,,,,,,,,,,,0
3930409,1976,05/437381,1974,1,1,1,1,1,"OSTRADYNE, INC.",0,US,Milford,CT,New Haven County,G,2,2,2,0,fl:ro_ln:ostrander-1,1,Robert F. Ostrander,fl:ja_ln:houck-3,1,James W. Houck,,,,,,,,,,,,,,,,,,,,,,0
3930410,1976,05/554335,1975,1,1,1,1,1,THE UNITED STATES OF AMERICA AS REPRESENTED BY THE SECRETARY OF THE ARMY,0,US,Washington,DC,District of Columbia,G,1,1,1,0,fl:ri_ln:ellison-5,1,Richard Ellison,,,,,,,,,,,,,,,,,,,,,,,,,0
3930411,1976,05/493838,1974,1,1,0,1,1,LINDE AKTIENGESELLSCHAFT,0,,,,,G,4,4,4,0,fl:ch_ln:beeker-2,1,Christoph Beeker,fl:wo_ln:melzer-2,1,Wolfgang Melzer,fl:ru_ln:romer-3,1,Rudiger Romer,vzwhro2zultjwjso70r8jbjy0,1,Gerhard Schieferstein,,,,,,,,,,,,,,,,0
3930412,1976,05/538351,1975,1,1,1,1,1,"KULITE SEMICONDUCTOR PRODUCTS, INC.",0,US,Ridgefield,NJ,Bergen,G,3,3,3,0,fl:jo_ln:mallon-4,1,Joseph R. Mallon,fl:an_ln:kurtz-1,1,Anthony D. Kurtz,5pie9kporb3cqx1tnlaxsqn43,1,John C. Kicks,,,,,,,,,,,,,,,,,,,0