patent_number,grant_year,application_number,application_year,d_inventor,d_assignee,d_location,d_application,d_ipc,assignee,assignee_ind,country,city,state,county,ipc_section,team_size,inventors,men_inventors,women_inventors,inventor_id1,male_flag1,inventor_name1,inventor_id2,male_flag2,inventor_name2,inventor_id3,male_flag3,inventor_name3,inventor_id4,male_flag4,inventor_name4,inventor_id5,male_flag5,inventor_name5,inventor_id6,male_flag6,inventor_name6,inventor_id7,male_flag7,inventor_name7,inventor_id8,male_flag8,inventor_name8,inventor_id9,male_flag9,inventor_name9,assignee_sequence
4065812,1978,05/723082,1976,1,0,0,1,1,,0,,,,,H,1,1,1,0,fl:di_ln:reichert-4,1,Dieter Reichert,,,,,,,,,,,,,,,,,,,,,,,,,
4065813,1978,05/699288,1976,1,0,0,1,1,,0,,,,,A,1,1,1,0,fl:ki_ln:hudson-1,1,Kirk R. Hudson,,,,,,,,,,,,,,,,,,,,,,,,,
4065814,1978,05/717214,1976,1,0,0,1,1,,0,,,,,A,1,1,1,0,fl:ed_ln:fox-11,1,Edgar N. Fox,,,,,,,,,,,,,,,,,,,,,,,,,
4065815,1978,05/727700,1976,1,0,0,1,1,,0,,,,,A,1,1,0,1,fl:ch_ln:senjung-1,0,Chen Sen-Jung,,,,,,,,,,,,,,,,,,,,,,,,,
4065816,1978,05/741476,1976,1,0,0,1,1,,0,,,,,A,1,1,1,0,fl:ph_ln:sawyer-2,1,Philip N. Sawyer,,,,,,,,,,,,,,,,,,,,,,,,,
4065817,1978,05/679709,1976,1,0,0,1,1,,0,,,,,A,2,2,2,0,fl:pe_ln:branemark-1,1,Per-Ingvar Branemark,fl:bo_ln:ekenstam-1,1,Bo Thuresson af Ekenstam,,,,,,,,,,,,,,,,,,,,,,
4065818,1978,05/685423,1976,1,0,0,1,1,,0,,,,,A F,1,1,1,0,fl:fr_ln:farina-4,1,Frederick P. Farina,,,,,,,,,,,,,,,,,,,,,,,,,
4065819,1978,05/696590,1976,1,1,1,1,1,"MED-PRO, LTD.",0,US,East Brunswick Township,NJ,Middlesex,A,1,1,0,1,fl:jo_ln:gorran-1,0,Jody A. Gorran,,,,,,,,,,,,,,,,,,,,,,,,,0
4065820,1978,05/747399,1976,1,0,0,1,1,,0,,,,,B,1,1,1,0,38edq0sv1l8ilc1r620oteos4,1,"Medford L. Starratt, Jr.",,,,,,,,,,,,,,,,,,,,,,,,,
4065821,1978,05/792369,1977,1,1,1,1,1,COMPAGNIE INDUSTRIELLE DES TELECOMMUNICATIONS CIT-ALCATEL,0,FR,Paris,,,B,1,1,1,0,k3x3dgbuhpayn8g03i2hl1ps5,1,Guy Lepreux,,,,,,,,,,,,,,,,,,,,,,,,,0
4065822,1978,05/661915,1976,1,1,1,1,1,TEXACO INC.,0,US,New York,NY,New York County,B,1,1,1,0,fl:ja_ln:wilbourn-2,1,James P. Wilbourn,,,,,,,,,,,,,,,,,,,,,,,,,0
4065823,1978,05/741342,1976,1,0,0,1,1,,0,,,,,B,2,2,2,0,fl:ja_ln:lorenzen-1,1,James Lorenzen,fl:br_ln:schaefer-7,1,Bruce John Schaefer,,,,,,,,,,,,,,,,,,,,,,
4065824,1978,05/711477,1976,1,1,1,1,1,"ELLIS INDUSTRIES, INC.",0,US,South El Monte,CA,Los Angeles,B,2,2,1,1,fl:la_ln:ellis-1,0,Lawrence D. Ellis,fl:ro_ln:evans-28,1,Robert E. Evans,,,,,,,,,,,,,,,,,,,,,,0
4065825,1978,05/668633,1976,1,0,0,1,1,,0,,,,,E,1,1,1,0,fl:an_ln:cohen-13,1,Antony S. Cohen,,,,,,,,,,,,,,,,,,,,,,,,,
4065826,1978,05/634749,1975,1,1,0,1,1,IMPERIAL CHEMICAL INDUSTRIES PLC,0,,,,,A,1,1,1,0,fl:ed_ln:hough-1,1,Edmund Alan Hough,,,,,,,,,,,,,,,,,,,,,,,,,0
4065827,1978,05/679707,1976,1,1,0,1,1,SCHLEGEL (UK) LIMITED,0,,,,,E,1,1,1,0,f01s7dizoc81n6hd7a2y3qm25,1,Martin John Aardal,,,,,,,,,,,,,,,,,,,,,,,,,0
4065828,1978,05/683580,1976,1,0,0,1,1,,0,,,,,E,1,1,1,0,fl:al_ln:lancaster-3,1,Alfred John Lancaster,,,,,,,,,,,,,,,,,,,,,,,,,
4065829,1978,05/722433,1976,1,1,0,1,1,"KARL LAUTENSCHLAGER KG, MOBELBESCHLAGFABRIK",0,,,,,E,1,1,1,0,fl:ka_ln:lautenschlager-1,1,Karl Lautenschlager,,,,,,,,,,,,,,,,,,,,,,,,,0
4065830,1978,05/687983,1976,1,0,0,1,1,,0,,,,,A,1,1,1,0,agszobfk9cbiv2h8hb6xqo7s1,1,Ludwig Pfatischer,,,,,,,,,,,,,,,,,,,,,,,,,
4065831,1978,05/696179,1976,1,0,0,1,1,,0,,,,,D,1,1,1,0,r4c86m2shcjqvz8kfow5opdr2,1,Arnold G. Huntsinger,,,,,,,,,,,,,,,,,,,,,,,,,
4065832,1978,05/772990,1977,1,1,1,1,1,SCOTT PAPER COMPANY,0,US,Philadelphia,PA,Philadelphia,D,1,1,1,0,fl:ru_ln:neuenschwander-1,1,Rudolf Neuenschwander,,,,,,,,,,,,,,,,,,,,,,,,,0
4065833,1978,05/702700,1976,1,0,0,1,1,,0,,,,,A,1,1,1,0,fl:la_ln:bender-2,1,Lawrence C. Bender,,,,,,,,,,,,,,,,,,,,,,,,,
4065834,1978,05/686037,1976,1,0,0,1,1,,0,,,,,A,1,1,1,0,fl:ar_ln:montague-1,1,"Archer A. Montague, Jr.",,,,,,,,,,,,,,,,,,,,,,,,,
4065835,1978,05/739439,1976,1,1,0,1,1,YOSHIDA KOGYO KABUSHIKI KAISHA,0,,,,,A,1,0,0,0,fl:ki_ln:yoneya-1,,Kiyoo Yoneya,,,,,,,,,,,,,,,,,,,,,,,,,0
4065836,1978,05/761574,1977,1,1,1,1,1,ALLIED CORPORATION,0,US,Morristown,NJ,Morris,A,1,1,1,0,fl:ro_ln:stephenson-11,1,Robert L. Stephenson,,,,,,,,,,,,,,,,,,,,,,,,,0
4065837,1978,05/710365,1976,1,1,0,1,1,FRANZ MULLER GMBH & CO.,0,,,,,D,3,2,2,0,fl:fr_ln:gierse-1,1,Franz-Josef Gierse,fl:ca_ln:bastert-1,1,Carl-Christian Bastert,fl:wi_ln:busch-2,,Wilhelm Busch,,,,,,,,,,,,,,,,,,,0
4065838,1978,05/755724,1976,1,1,1,1,1,E. I. DU PONT DE NEMOURS AND COMPANY,0,US,Wilmington,DE,New Castle,D,2,2,2,0,fl:ra_ln:jungpeter-1,1,Raymond R. Jungpeter,fl:je_ln:buchholz-3,1,Jean L. Buchholz,,,,,,,,,,,,,,,,,,,,,,0
4065839,1978,05/705692,1976,1,1,0,1,1,SIEMENS AKTIENGESELLSCHAFT,0,,,,,B,1,1,1,0,fl:ma_ln:pointner-1,1,Martin Pointner,,,,,,,,,,,,,,,,,,,,,,,,,0
4065840,1978,05/751920,1976,1,1,1,1,1,INTERNATIONAL BUSINESS MACHINES CORPORATION,0,US,Armonk,NY,Westchester,H,2,2,2,0,fl:ky_ln:park-43,1,Kyu-Chang Park,fl:ar_ln:reisman-1,1,Arnold Reisman,,,,,,,,,,,,,,,,,,,,,,0
4065841,1978,05/716683,1976,1,0,0,1,1,,0,,,,,B,1,1,1,0,fl:ma_ln:gysin-1,1,Max Gysin,,,,,,,,,,,,,,,,,,,,,,,,,
4065842,1978,05/783449,1977,1,1,0,1,1,VALMET OY,0,,,,,A F,1,1,1,0,fl:ei_ln:aatinen-1,1,Eino Aatinen,,,,,,,,,,,,,,,,,,,,,,,,,0
4065843,1978,05/728980,1976,1,0,0,1,1,,0,,,,,B,1,1,1,0,u6r6ek0oxg9fw46kzta71zhmr,1,Alfonso M. Elola,,,,,,,,,,,,,,,,,,,,,,,,,
4065844,1978,05/712688,1976,1,0,0,1,1,,0,,,,,B,2,2,1,1,fl:ma_ln:lieser-1,1,Martin J. Lieser,9a5gldok1uxhv1rxlothdhjg1,0,Donna Jean Lieser,,,,,,,,,,,,,,,,,,,,,,
4065845,1978,05/569985,1975,1,1,0,1,1,OY TAMPELLA AB,0,,,,,B E,3,3,3,0,fl:ro_ln:strom-4,1,Rolf Strom,fl:ve_ln:heikkila-3,1,Veikko Heikkila,fl:le_ln:hakkinen-1,1,Leo Hakkinen,,,,,,,,,,,,,,,,,,,0
4065846,1978,05/695605,1976,1,1,1,1,1,BECHTEL INTERNATIONAL CORPORATION,0,US,San Francisco,CA,San Francisco,B,1,1,1,0,fl:by_ln:leonard-1,1,"Byron H. Leonard, Jr.",,,,,,,,,,,,,,,,,,,,,,,,,0
4065847,1978,05/718461,1976,1,1,1,1,1,COMMISSARIAT A L'ENERGIE ATOMIQUE,0,FR,Paris,,,B,3,3,3,0,fl:jo_ln:borel-1,1,Joseph Borel,fl:ja_ln:lacour-1,1,Jacques Lacour,fl:ge_ln:merckel-1,1,Gerard Merckel,,,,,,,,,,,,,,,,,,,0
4065848,1978,05/668743,1976,1,0,0,1,1,,0,,,,,H,1,1,1,0,fl:no_ln:dery-1,1,Normand Dery,,,,,,,,,,,,,,,,,,,,,,,,,
4065849,1978,05/768107,1977,1,1,1,1,1,THE CHASE-SHAWMUT COMPANY,0,US,Newburyport,MA,Essex,H,1,1,1,0,fl:fr_ln:kozacka-1,1,Frederick J. Kozacka,,,,,,,,,,,,,,,,,,,,,,,,,0
4065850,1978,05/604204,1975,1,1,1,1,1,KOLLMORGEN TECHNOLOGIES CORPORATION,0,US,Dallas,TX,Dallas County,H,3,3,3,0,fl:ro_ln:burr-4,1,Robert P. Burr,fl:ro_ln:morino-1,1,Ronald Morino,fl:ra_ln:keogh-2,1,Raymond J. Keogh,,,,,,,,,,,,,,,,,,,0
4065851,1978,05/738615,1976,1,1,0,1,1,W. C. HERAEUS GMBH,0,,,,,H,4,4,4,0,fl:fr_ln:kummer-1,1,Franz Kummer,fl:ge_ln:mai-1,1,Gerhard Mai,fl:ro_ln:ruthardt-1,1,Rolf Ruthardt,fl:ho_ln:thiede-2,1,Horst Thiede,,,,,,,,,,,,,,,,0
4065852,1978,05/705946,1976,1,1,1,1,1,MILLER FLUID POWER CORPORATION,0,US,Bensenville,IL,DuPage,F,1,1,1,0,fl:jo_ln:bowbin-1,1,John F. Bowbin,,,,,,,,,,,,,,,,,,,,,,,,,0
4065853,1978,05/763169,1977,1,1,1,1,1,THE UNITED STATES OF AMERICA AS REPRESENTED BY THE ADMINISTRATOR OF THE NATIONAL AERONAUTICS AND SPACE ADMINISTRATION,0,US,Washington,DC,District of Columbia,B,2,2,2,0,fl:ed_ln:lewandowski-3,1,Edward F. Lewandowski,fl:pe_ln:anderson-36,1,Petrus A. Anderson,,,,,,,,,,,,,,,,,,,,,,0
4065854,1978,05/727766,1976,1,0,0,1,1,,0,,,,,G,1,1,1,0,fl:do_ln:reed-20,1,Donald Michael Reed,,,,,,,,,,,,,,,,,,,,,,,,,
4065855,1978,05/472110,1974,1,0,0,1,1,,0,,,,,B,1,1,1,0,fl:no_ln:coe-2,1,Norman O. Coe,,,,,,,,,,,,,,,,,,,,,,,,,
4065856,1978,05/683139,1976,1,1,0,1,1,BRITISH RAILWAYS BOARD,0,,,,,E,1,1,1,0,fl:jo_ln:waters-13,1,John Waters,,,,,,,,,,,,,,,,,,,,,,,,,0
4065857,1978,05/624967,1975,1,1,1,1,1,SUNFRESH PRODUCTS,0,US,Napa,CA,Napa,F,3,3,3,0,fl:la_ln:nelson-9,1,Lawrence B. Nelson,fl:st_ln:mott-9,1,Stuart A. Mott,fl:ra_ln:flugger-1,1,Ray T. Flugger,,,,,,,,,,,,,,,,,,,0
4065858,1978,05/714315,1976,1,0,0,1,1,,0,,,,,G,1,1,1,0,fl:ja_ln:harte-3,1,James Richard Harte,,,,,,,,,,,,,,,,,,,,,,,,,
4065859,1978,05/397147,1973,1,1,1,1,1,THE SINGER COMPANY,0,US,Binghamton,NY,Broome,B G,1,1,1,0,fl:ri_ln:mecklenborg-1,1,Richard A. Mecklenborg,,,,,,,,,,,,,,,,,,,,,,,,,0
4065860,1978,05/615414,1975,1,1,1,1,1,"SPARTANICS, LTD.",0,US,Rolling Meadows,IL,Cook,F G,3,2,2,0,fl:jo_ln:linton-4,,John D. Linton,fl:sa_ln:willits-1,1,Samuel P. Willits,fl:wi_ln:mohan-1,1,William L. Mohan,,,,,,,,,,,,,,,,,,,0
4065861,1978,05/709966,1976,1,0,0,1,1,,0,,,,,A,1,1,1,0,fl:ra_ln:pelfrey-1,1,Raymond Pelfrey,,,,,,,,,,,,,,,,,,,,,,,,,
4065862,1978,05/613249,1975,1,1,1,1,1,AMERICAN EXPRESS COMPANY,0,US,New York,NY,New York County,G,1,1,1,0,fl:ru_ln:meyer-2,1,Russell L. Meyer,,,,,,,,,,,,,,,,,,,,,,,,,0
4065863,1978,05/731548,1976,1,0,0,1,1,,0,,,,,G,1,1,1,0,fl:ro_ln:burgess-2,1,Roy Burgess,,,,,,,,,,,,,,,,,,,,,,,,,
4065864,1978,05/729026,1976,1,1,1,1,1,234966 WHOLESALE LTD.,0,CA,Paris,ON,,G,1,1,1,0,fl:wi_ln:stanley-4,1,William J. Stanley,,,,,,,,,,,,,,,,,,,,,,,,,0
4065865,1978,05/710634,1976,1,1,1,1,1,SOCIETE CYBERSON,0,FR,Lyon,,,F G,1,1,1,0,muqk2yam807u06um5bfndl718,1,Stephan Chovan,,,,,,,,,,,,,,,,,,,,,,,,,0
4065866,1978,05/753649,1976,1,1,1,1,1,"PIONEER PRODUCTS, INC.",0,US,Old Saybrook,CT,Middlesex County,F,1,1,1,0,fl:ju_ln:eguizabal-1,1,Julian Eguizabal,,,,,,,,,,,,,,,,,,,,,,,,,0
4065867,1978,05/747776,1976,1,0,0,1,1,,0,,,,,F,1,1,1,0,fl:da_ln:storey-8,1,DALE STOREY,,,,,,,,,,,,,,,,,,,,,,,,,
4065868,1978,05/739087,1976,1,0,0,1,1,,0,,,,,F,1,1,1,0,fl:da_ln:johnson-110,1,David A. Johnson,,,,,,,,,,,,,,,,,,,,,,,,,
4065869,1978,05/413875,1973,1,1,1,1,1,MADELINE E. BERRY,1,US,Lathrup Village,MI,Oakland,A,1,1,1,0,fl:ar_ln:berry-4,1,Arthur E. Berry,,,,,,,,,,,,,,,,,,,,,,,,,0
4065870,1978,05/750781,1976,1,0,0,1,1,,0,,,,,A,1,0,0,0,fl:sa_ln:muko-1,,Sakae Muko,,,,,,,,,,,,,,,,,,,,,,,,,
4065871,1978,05/660387,1976,1,1,1,1,1,WOODSTREAM CORPORATION,0,US,Lititz,PA,Lancaster,A,1,1,1,0,fl:he_ln:loeffler-1,1,Herbert H. Loeffler,,,,,,,,,,,,,,,,,,,,,,,,,0
4065872,1978,05/695419,1976,1,1,1,1,1,VCA CORPORATION,0,US,Baton Rouge,LA,East Baton Rouge Parish,A,2,2,2,0,fl:ph_ln:patton-3,1,Phillips E. Patton,fl:no_ln:freeman-2,1,Norman Freeman,,,,,,,,,,,,,,,,,,,,,,0
4065873,1978,05/718998,1976,1,0,0,1,1,,0,,,,,A,1,1,1,0,fl:ro_ln:jones-46,1,Robert Jones,,,,,,,,,,,,,,,,,,,,,,,,,
4065874,1978,05/802850,1977,1,0,0,1,1,,0,,,,,A,1,0,0,0,fl:hu_ln:ross-4,,Hubertus R. Ross,,,,,,,,,,,,,,,,,,,,,,,,,
4065875,1978,05/724411,1976,1,1,1,1,1,UNIVERSITY OF DELAWARE,0,US,Newark,DE,New Castle County,A,1,1,1,0,g1u1ftblbhljuci6n8i9e7mzw,1,Richard Frank Srna,,,,,,,,,,,,,,,,,,,,,,,,,0
4065876,1978,05/710447,1976,1,0,0,1,1,,0,,,,,A,1,1,1,0,fl:f._ln:moffett-1,1,"F. Wesley Moffett, Jr.",,,,,,,,,,,,,,,,,,,,,,,,,
4065877,1978,05/741470,1976,1,0,0,1,1,,0,,,,,A,1,1,0,1,fl:al_ln:kelley-4,0,Albert W. Kelley,,,,,,,,,,,,,,,,,,,,,,,,,
4065878,1978,05/678940,1976,1,0,0,1,1,,0,,,,,E,1,1,1,0,fl:sa_ln:tsugane-1,1,Sachio Tsugane,,,,,,,,,,,,,,,,,,,,,,,,,
4065879,1978,05/687396,1976,1,0,0,1,1,,0,,,,,B,3,2,2,0,fl:sa_ln:cretella-1,1,Salvatore J. Cretella,fl:ma_ln:bernardo-1,,Matthew Bernardo,fl:ra_ln:demusis-2,1,Ralph T. DeMusis,,,,,,,,,,,,,,,,,,,
4065880,1978,05/694320,1976,1,1,0,1,1,MOLINS LIMITED,0,,,,,B,1,1,1,0,wt6kc4yisldr4c2jwu2t9th73,1,Philip Arthur Maw,,,,,,,,,,,,,,,,,,,,,,,,,0
4065881,1978,05/747820,1976,1,0,0,1,1,,0,,,,,B,1,1,1,0,fl:ro_ln:gillette-2,1,Robert H. Gillette,,,,,,,,,,,,,,,,,,,,,,,,,
4065882,1978,05/710729,1976,1,0,0,1,1,,0,,,,,B,1,1,1,0,fl:gi_ln:d'urso-4,1,Giuseppe D'Urso,,,,,,,,,,,,,,,,,,,,,,,,,
4065883,1978,05/647089,1976,1,0,0,1,1,,0,,,,,E,1,0,0,0,fl:le_ln:thibodeau-3,,Leo Thomas Thibodeau,,,,,,,,,,,,,,,,,,,,,,,,,
4065884,1978,05/729835,1976,1,1,1,1,1,NOVUS INC.,0,US,Minneapolis,MN,Hennepin,E,1,1,1,0,896uiovry8wumswv49zqjmcq3,1,David A. Tenquist,,,,,,,,,,,,,,,,,,,,,,,,,0
4065885,1978,05/438877,1974,1,1,1,1,1,"MONOGRAM INDUSTRIES, INC.",0,US,Santa Monica,CA,Los Angeles,E,2,2,2,0,fl:jo_ln:blick-1,1,John Blick,fl:ra_ln:fuller-7,1,Ralph Fuller,,,,,,,,,,,,,,,,,,,,,,0
4065886,1978,05/714364,1976,1,1,1,1,1,WILLIAM JAMES HARWOOD,1,US,Saginaw,MI,Saginaw,B,2,2,2,0,fl:wi_ln:harwood-5,1,William James Harwood,fl:ro_ln:snyder-21,1,Robert P. Snyder,,,,,,,,,,,,,,,,,,,,,,0
4065887,1978,05/665660,1976,1,0,0,1,1,,0,,,,,B,1,1,1,0,fl:th_ln:shrader-4,1,Thomas E. Shrader,,,,,,,,,,,,,,,,,,,,,,,,,
4065888,1978,05/668741,1976,1,0,0,1,1,,0,,,,,E,1,1,1,0,fl:re_ln:napierski-1,1,Reinhard Napierski,,,,,,,,,,,,,,,,,,,,,,,,,
4065889,1978,05/696635,1976,1,1,1,1,1,"AIR TITE INDUSTRIES, INC.",0,US,Clifton,NJ,Passaic,E,1,1,1,0,fl:do_ln:fraioli-2,1,Donato M. Fraioli,,,,,,,,,,,,,,,,,,,,,,,,,0
4065890,1978,05/748708,1976,1,0,0,1,1,,0,,,,,E,1,1,1,0,56l0iiz273q3knd4v0n433vb5,1,Wolfgang Fenner,,,,,,,,,,,,,,,,,,,,,,,,,
4065891,1978,05/717603,1976,1,0,0,1,1,,0,,,,,B E,1,1,1,0,fl:ke_ln:burgin-3,1,Kermit H. Burgin,,,,,,,,,,,,,,,,,,,,,,,,,
4065892,1978,05/722883,1976,1,0,0,1,1,,0,,,,,E,1,1,1,0,fl:ro_ln:lawrence-23,1,Robert Raymond Lawrence,,,,,,,,,,,,,,,,,,,,,,,,,
4065893,1978,05/649667,1976,1,0,0,1,1,,0,,,,,E,1,1,1,0,fl:ar_ln:epes-1,1,Archie C. Epes,,,,,,,,,,,,,,,,,,,,,,,,,
4065894,1978,05/639055,1975,1,0,0,1,1,,0,,,,,E,1,1,1,0,fl:ra_ln:day-5,1,Ralph K. Day,,,,,,,,,,,,,,,,,,,,,,,,,
4065895,1978,05/699133,1976,1,0,0,1,1,,0,,,,,E,2,2,2,0,fl:ri_ln:shank-3,1,Richard S. Shank,fl:fr_ln:hermanson-2,1,Fred H. Hermanson,,,,,,,,,,,,,,,,,,,,,,
4065896,1978,05/779729,1977,1,1,1,1,1,BARGAR METAL FABRICATING COMPANY,0,US,Cleveland,OH,Cuyahoga,E,1,1,1,0,fl:jo_ln:penczak-1,1,John P. Penczak,,,,,,,,,,,,,,,,,,,,,,,,,0
4065897,1978,05/486906,1974,1,0,0,1,1,,0,,,,,E,1,1,1,0,u7qg17hmkeexib6kfvp8jbdhv,1,Branko Zezelj,,,,,,,,,,,,,,,,,,,,,,,,,
4065898,1978,05/579143,1975,1,1,0,1,1,FURNIER-UND SPERRHOLZWERK J. F. WERZ JR. KG WERZALIT PRESSHOLZWERK,0,,,,,E,1,1,1,0,fl:ed_ln:munk-1,1,Edmund Munk,,,,,,,,,,,,,,,,,,,,,,,,,0
4065899,1978,05/455618,1974,1,0,0,1,1,,0,,,,,E,1,1,1,0,fl:wi_ln:kirkhuff-1,1,William J. Kirkhuff,,,,,,,,,,,,,,,,,,,,,,,,,
4065900,1978,05/639798,1975,1,1,0,1,1,SCHLEGEL CORPORATION,0,,,,,E,1,1,1,0,fl:fr_ln:eggert-1,1,Frank Eggert,,,,,,,,,,,,,,,,,,,,,,,,,0
4065901,1978,05/759177,1977,1,0,0,1,1,,0,,,,,E,1,1,1,0,fl:fr_ln:fruh-2,1,Friedrich Fruh,,,,,,,,,,,,,,,,,,,,,,,,,
4065902,1978,05/735170,1976,1,0,0,1,1,,0,,,,,E,1,1,1,0,fl:si_ln:lindal-1,1,Sir Walter Lindal,,,,,,,,,,,,,,,,,,,,,,,,,
4065903,1978,05/635783,1975,1,1,0,1,1,NATIONAL RESEARCH DEVELOPMENT CORPORATION,0,,,,,E,1,1,1,0,fl:jo_ln:morley-7,1,John Godfrey Morley,,,,,,,,,,,,,,,,,,,,,,,,,0
4065904,1978,05/635079,1975,1,0,0,1,1,,0,,,,,E,2,2,2,0,fl:pe_ln:taylor-4,1,Peter J. Taylor,fl:br_ln:considine-1,1,Brian C. Considine,,,,,,,,,,,,,,,,,,,,,,
4065905,1978,05/617507,1975,1,0,0,1,1,,0,,,,,E,1,1,1,0,fl:co_ln:vanderlely-2,1,Cornelis van der Lely,,,,,,,,,,,,,,,,,,,,,,,,,
4065906,1978,05/694408,1976,1,0,0,1,1,,0,,,,,A E,1,0,0,0,fl:st_ln:mears-1,,Stowell W. Mears,,,,,,,,,,,,,,,,,,,,,,,,,
4065907,1978,05/340689,1973,1,1,1,1,1,"UNICON PARKING STRUCTURES, INC.",0,US,San Fernando,CA,Los Angeles,E,1,1,1,0,fl:ed_ln:rice-4,1,Edward K. Rice,,,,,,,,,,,,,,,,,,,,,,,,,0
4065908,1978,05/680467,1976,1,1,1,1,1,"OWENS-ILLINOIS, INC.",0,US,Toledo,OH,Lucas,B,1,1,1,0,fl:ma_ln:mueller-64,1,Martin Mueller,,,,,,,,,,,,,,,,,,,,,,,,,0
4065909,1978,05/680466,1976,1,1,1,1,1,"OWENS-ILLINOIS, INC.",0,US,Toledo,OH,Lucas,B,1,1,1,0,fl:ma_ln:mueller-64,1,Martin Mueller,,,,,,,,,,,,,,,,,,,,,,,,,0
4065910,1978,05/717167,1976,1,1,0,1,1,RECTICEL DEUTSCHLAND KUNSTSTOFFE GMBH,0,,,,,B,1,1,1,0,fl:gu_ln:eiselt-1,1,Gunter Eiselt,,,,,,,,,,,,,,,,,,,,,,,,,0
4065911,1978,05/704331,1976,1,1,1,1,1,"AMTRON, DIVISION OF THE SIPPICAN CORPORATION",0,US,Midlothian,IL,Cook,B,1,1,1,0,fl:jo_ln:fagan-9,1,John Fagan,,,,,,,,,,,,,,,,,,,,,,,,,0
4065912,1978,05/700691,1976,1,1,1,1,1,MASSEY-FERGUSON SERVICES N.V.,0,NL,Willemstad,,,A B,1,1,1,0,fl:do_ln:quick-2,1,Donald J. Quick,,,,,,,,,,,,,,,,,,,,,,,,,0
4065913,1978,05/766377,1977,1,1,1,1,1,BAYER AKTIENGESELLSCHAFT,0,US,Kankakee,IL,Kankakee,A,2,2,2,0,fl:ge_ln:fisher-2,1,Gerald C. Fisher,fl:jo_ln:scanland-1,1,Joseph E. Scanland,,,,,,,,,,,,,,,,,,,,,,0
4065914,1978,05/666805,1976,1,1,1,1,1,INTERNATIONAL HARVESTER COMPANY,0,US,Chicago,IL,Cook County,A,3,3,3,0,fl:ca_ln:phillips-5,1,Carmen S. Phillips,fl:ra_ln:beyer-4,1,Ralph Beyer,vmlvnpfts8psjx340arptzelg,1,Gerald E. Sepich,,,,,,,,,,,,,,,,,,,0
4065915,1978,05/592455,1975,1,0,0,1,1,,0,,,,,G,1,1,1,0,fl:jo_ln:farnbach-1,1,John S. Farnbach,,,,,,,,,,,,,,,,,,,,,,,,,
4065916,1978,05/759696,1977,1,1,1,1,1,TEXAS INSTRUMENTS INCORPORATED,0,US,Dallas,TX,Dallas County,G,1,1,1,0,fl:ho_ln:leuschner-1,1,Horst Leuschner,,,,,,,,,,,,,,,,,,,,,,,,,0
4065917,1978,05/752272,1976,1,1,1,1,1,ENGELHARD MINERALS & CHEMICALS CORPORATION,0,US,Iselin,NJ,Middlesex,F,1,1,1,0,fl:wi_ln:pfefferle-1,1,William C. Pfefferle,,,,,,,,,,,,,,,,,,,,,,,,,0
4065918,1978,05/331680,1973,1,1,1,1,1,ETHYL CORPORATION,0,US,Richmond,VA,Richmond city,F,1,1,1,0,fl:el_ln:rifkin-1,1,Ellis B. Rifkin,,,,,,,,,,,,,,,,,,,,,,,,,0
4065919,1978,05/541894,1975,1,0,0,1,1,,0,,,,,F,1,1,1,0,fl:hr_ln:eknayan-1,1,Hrant Eknayan,,,,,,,,,,,,,,,,,,,,,,,,,
4065920,1978,05/663140,1976,1,0,0,1,1,,0,,,,,F,2,2,2,0,fl:hi_ln:minami-25,1,Hidehiro Minami,fl:ma_ln:waku-2,1,Makio Waku,,,,,,,,,,,,,,,,,,,,,,
4065921,1978,05/744624,1976,1,1,1,1,1,DANFOSS A/S,0,DK,Nordborg,,,F,2,2,2,0,fl:jo_ln:baatrup-1,1,Johannes V. Baatrup,fl:th_ln:christensen-14,1,Thorkild Christensen,,,,,,,,,,,,,,,,,,,,,,0
4065922,1978,05/716476,1976,1,1,1,1,1,SYSMEX CORPORATION,0,US,Portland,OR,Multnomah County,F,2,2,2,0,fl:ja_ln:ott-3,1,James I. Ott,fl:de_ln:schwab-4,1,Delmar G. Schwab,,,,,,,,,,,,,,,,,,,,,,0
4065923,1978,05/729713,1976,1,0,0,1,1,,0,,,,,E,1,1,1,0,fl:pa_ln:preus-1,1,Paul Preus,,,,,,,,,,,,,,,,,,,,,,,,,
4065924,1978,05/587626,1975,1,0,0,1,1,,0,,,,,E,1,0,0,0,fl:da_ln:young-74,,Daniel A. Young,,,,,,,,,,,,,,,,,,,,,,,,,
4065925,1978,05/682492,1976,1,0,0,1,1,,0,,,,,E F,1,1,1,0,fl:ro_ln:auriemma-1,1,Robert Sinbad Auriemma,,,,,,,,,,,,,,,,,,,,,,,,,
4065926,1978,05/597194,1975,1,0,0,1,1,,0,,,,,E N,1,1,1,0,fl:ed_ln:brandt-4,1,Edison R. Brandt,,,,,,,,,,,,,,,,,,,,,,,,,
4065927,1978,05/542149,1975,1,1,1,1,1,CONTINENTAL OIL COMPANY,0,US,Ponca City,OK,Kay County,E,1,1,1,0,fl:j._ln:davis-3,1,"J. Gilbert Davis, II",,,,,,,,,,,,,,,,,,,,,,,,,0
4065928,1978,05/719698,1976,1,1,0,1,1,"TAKENAKA KOMUTEN CO., LTD.",0,,,,,E,4,4,4,0,fl:at_ln:takagi-5,1,Atsushi Takagi,fl:hi_ln:kuroiwa-3,1,Hiroyuki Kuroiwa,fl:ma_ln:miyaguchi-3,1,Masao Miyaguchi,fl:ta_ln:kawamura-45,1,Tateo Kawamura,,,,,,,,,,,,,,,,0
4065929,1978,05/664437,1976,1,1,1,1,1,ATLANTIC RICHFIELD COMPANY,0,US,Los Angeles,CA,Los Angeles,E,1,1,1,0,fl:te_ln:simpson-4,1,Terry Lee Simpson,,,,,,,,,,,,,,,,,,,,,,,,,0
4065930,1978,05/783469,1977,1,1,0,1,1,BOCHUMER EISENHUTTE HEINTZMANN GMBH & CO. KG,0,,,,,E,1,1,1,0,fl:kl_ln:spies-1,1,Klaus Spies,,,,,,,,,,,,,,,,,,,,,,,,,0
4065931,1978,05/794933,1977,1,1,0,1,1,BOCHUMER EISENHUTTE HEINTZMANN GMBH & CO. KG,0,,,,,E,2,2,2,0,fl:gu_ln:neu-1,1,Gustav Neu,fl:ha_ln:bemmerl-1,1,Hans-Ferdinand Bemmerl,,,,,,,,,,,,,,,,,,,,,,0
4065932,1978,05/749259,1976,1,1,1,1,1,SOGELERG,0,FR,Chevilly-Larue,,,E,1,1,1,0,fl:ja_ln:oger-1,1,Jacques Oger,,,,,,,,,,,,,,,,,,,,,,,,,0
4065933,1978,05/728138,1976,1,1,0,1,1,"TAKENAKA KOMUTEN CO., LTD.",0,,,,,E,1,1,1,0,fl:ic_ln:katayama-1,1,Ichiro Katayama,,,,,,,,,,,,,,,,,,,,,,,,,0
4065934,1978,05/639431,1975,1,1,1,1,1,"JAMES G. BROWN & ASSOCIATES, INC.",0,US,Houston,TX,Harris County,E,1,1,1,0,fl:ed_ln:dysarz-1,1,Edward D. Dysarz,,,,,,,,,,,,,,,,,,,,,,,,,0
4065935,1978,05/705933,1976,1,1,0,1,1,TAYLOR WOODROW CONSTRUCTION LIMITED,0,,,,,E,2,2,2,0,fl:re_ln:burrow-1,1,Reginald Edward Dowton Burrow,c5mgaia151u0etswcq0d5ok7q,1,David Edmund Plaskitt,,,,,,,,,,,,,,,,,,,,,,0
4065936,1978,05/696605,1976,1,1,1,1,1,BORGWARNER INC.,0,US,Chicago,IL,Cook County,F,3,2,2,0,fl:jo_ln:fenton-5,1,John W. Fenton,fl:je_ln:lee-270,,Jerry Lee,fl:ri_ln:buist-1,1,Richard J. Buist,,,,,,,,,,,,,,,,,,,0
4065937,1978,05/651103,1976,1,0,0,1,1,,0,,,,,F,4,4,4,0,fl:ma_ln:burger-14,1,Manfred Burger,fl:er_ln:gagel-1,1,Ernst Gagel,fl:ru_ln:kalmovicz-1,1,Rudolf Kalmovicz,fl:al_ln:prechtl-1,1,Alfred Prechtl,,,,,,,,,,,,,,,,
4065938,1978,05/646711,1976,1,1,1,1,1,"SUN-ECON, INC.",0,US,Ballston Lake,NY,Town of Clifton Park,F,1,1,1,0,fl:kj_ln:jonsson-1,1,Kjartan A. Jonsson,,,,,,,,,,,,,,,,,,,,,,,,,0
4065939,1978,05/653897,1976,1,1,1,1,1,THE SINGER COMPANY,0,US,New York,NY,New York County,F,2,2,2,0,fl:ja_ln:thornbery-1,1,James M. Thornbery,fl:ch_ln:orth-3,1,Charles D. Orth,,,,,,,,,,,,,,,,,,,,,,0
4065940,1978,05/695739,1976,1,0,0,1,1,,0,,,,,A,1,1,1,0,z6r3yvbo0vpsbjiv9v2pphajj,1,Murray A. Gordon,,,,,,,,,,,,,,,,,,,,,,,,,
4065941,1978,05/578173,1975,1,1,0,1,1,HITACHI HIGH-TECHNOLOGIES CORPORATION,0,,,,,F,1,1,0,1,fl:sa_ln:aoki-17,0,Sadashiro Aoki,,,,,,,,,,,,,,,,,,,,,,,,,0
4065942,1978,05/641642,1975,1,1,1,1,1,"ELITEX, KONCERN TEXTILNIHO STROJIRENSTVI",0,CZ,Liberec,,,A,2,2,2,0,rtkprwewtwx40i9f42mydd3h6,1,Bohumil Kejnovsky,fl:mi_ln:kopecny-1,1,Miroslav Kopecny,,,,,,,,,,,,,,,,,,,,,,0
4065943,1978,05/690502,1976,1,1,0,1,1,BADISCHE MASCHINENFABRIK GMBH,0,,,,,C,4,3,3,0,fl:ji_ln:dokoupil-1,1,Jiri Dokoupil,fl:ho_ln:zapfel-1,1,Horst Zapfel,fl:er_ln:gabelmann-1,1,Erich Gabelmann,fl:he_ln:breitwieser-3,,Helmut Breitwieser,,,,,,,,,,,,,,,,0
4065944,1978,05/667085,1976,1,0,0,1,1,,0,,,,,E,1,1,1,0,fl:ja_ln:webster-10,1,James A. Webster,,,,,,,,,,,,,,,,,,,,,,,,,
4065945,1978,05/710477,1976,1,1,1,1,1,ATELIERS DE LA MOTOBECANE,0,FR,Pantin,,,E,1,1,1,0,fl:er_ln:jaulmes-1,1,Eric Jaulmes,,,,,,,,,,,,,,,,,,,,,,,,,0
4065946,1978,05/658907,1976,1,1,1,1,1,"BRAMMALL, INC.",0,US,Angola,IN,Steuben,E,3,3,1,2,fl:le_ln:loynes-1,0,Leslie M. Loynes,fl:da_ln:walters-32,0,Darrel Walters,fl:cl_ln:penick-1,1,"Clarence A. Penick, Jr.",,,,,,,,,,,,,,,,,,,0
4065947,1978,05/747103,1976,1,0,0,1,1,,0,,,,,B,1,1,1,0,fl:pa_ln:mazier-1,1,Paul Mazier,,,,,,,,,,,,,,,,,,,,,,,,,
4065948,1978,05/628558,1975,1,1,0,1,1,MITSUBISHI JUKOGYO KABUSHIKI KAISHA,0,,,,,B,2,1,1,0,fl:hi_ln:tsukamoto-21,,Hidehiko Tsukamoto,fl:no_ln:maeda-6,1,Nobutaka Maeda,,,,,,,,,,,,,,,,,,,,,,0
4065949,1978,05/751358,1976,1,1,0,1,1,MOELLER & NEUMANN GMBH,0,,,,,B,1,1,1,0,fl:gu_ln:morath-1,1,Gunther Morath,,,,,,,,,,,,,,,,,,,,,,,,,0
4065950,1978,05/715498,1976,1,1,0,1,1,UNITED KINGDOM ATOMIC ENERGY AUTHORITY,0,,,,,B,2,2,2,0,fl:de_ln:green-10,1,Derek J. Green,fl:mu_ln:green-1,1,"Muriel Irene Green, executrix",,,,,,,,,,,,,,,,,,,,,,0
4065951,1978,05/738479,1976,1,1,1,1,1,NATIONAL CAN CORPORATION,0,US,Chicago,IL,Cook County,B,1,1,1,0,fl:se_ln:lyu-3,1,Seung W. Lyu,,,,,,,,,,,,,,,,,,,,,,,,,0
4065952,1978,05/768178,1977,1,1,1,1,1,USM CORPORATION,0,US,Boston,MA,Suffolk,B,1,1,1,0,fl:da_ln:holloway-6,1,David J. Holloway,,,,,,,,,,,,,,,,,,,,,,,,,0
4065953,1978,05/742040,1976,1,1,0,1,1,MANNESMANN AKTIENGESELLSCHAFT,0,,,,,B,3,3,3,0,fl:he_ln:frentzen-1,1,Hermann Josef Frentzen,fl:ri_ln:gerretz-1,1,Richard Gerretz,fl:ew_ln:henn-1,1,Ewald Henn,,,,,,,,,,,,,,,,,,,0
4065954,1978,05/631064,1975,1,1,0,1,1,ERICH GRAU STANZWERK FUR ELEKTROBLECHE,0,,,,,B,1,1,1,0,fl:ma_ln:gotz-14,1,Martin Gotz,,,,,,,,,,,,,,,,,,,,,,,,,0
4065955,1978,05/689393,1976,1,1,1,1,1,FOSTER NEEDLE COMPANY,0,US,Manitowoc,WI,Manitowoc,B,1,1,1,0,fl:ed_ln:foster-3,1,Edson Perkins Foster,,,,,,,,,,,,,,,,,,,,,,,,,0
4065956,1978,05/681725,1976,1,1,0,1,1,SIEMENS AKTIENGESELLSCHAFT,0,,,,,G,3,3,3,0,fl:he_ln:trattner-1,1,Hermann Trattner,fl:ku_ln:saatze-1,1,Kuno Saatze,veoao01tzwvzjetf6qre68ikk,1,Adolf Bauereiss,,,,,,,,,,,,,,,,,,,0
4065957,1978,05/742142,1976,1,1,1,1,1,CALSPAN CORPORATION,0,US,Buffalo,NY,Erie,G,1,1,1,0,fl:jo_ln:beilman-1,1,John L. Beilman,,,,,,,,,,,,,,,,,,,,,,,,,0
4065958,1978,05/733384,1976,1,0,0,1,1,,0,,,,,G,2,2,1,1,fl:el_ln:krylova-1,0,Eleonora Dmitrievna Krylova,fl:ni_ln:brazhnikov-1,1,Nikolai Ivanovich Brazhnikov,,,,,,,,,,,,,,,,,,,,,,
4065959,1978,05/748632,1976,1,1,1,1,1,RICHMORE COMPANY,0,US,Denver,CO,Denver County,G,1,0,0,0,fl:ha_ln:richardson-7,,Harold W. Richardson,,,,,,,,,,,,,,,,,,,,,,,,,0