patent_number,grant_year,application_number,application_year,d_inventor,d_assignee,d_location,d_application,d_ipc,assignee,assignee_ind,country,city,state,county,ipc_section,team_size,inventors,men_inventors,women_inventors,inventor_id1,male_flag1,inventor_name1,inventor_id2,male_flag2,inventor_name2,inventor_id3,male_flag3,inventor_name3,inventor_id4,male_flag4,inventor_name4,inventor_id5,male_flag5,inventor_name5,inventor_id6,male_flag6,inventor_name6,inventor_id7,male_flag7,inventor_name7,inventor_id8,male_flag8,inventor_name8,inventor_id9,male_flag9,inventor_name9,assignee_sequence
4180867,1980,05/881758,1978,1,0,0,1,1,,0,,,,,A E,1,1,1,0,fl:ma_ln:ridgeway-3,1,"Marcus L. Ridgeway, Jr.",,,,,,,,,,,,,,,,,,,,,,,,,
4180868,1980,05/851785,1977,1,0,0,1,1,,0,,,,,A,1,1,1,0,fl:ch_ln:snow-1,1,Charles C. Snow,,,,,,,,,,,,,,,,,,,,,,,,,
4180869,1980,05/812057,1977,1,1,1,1,1,COLGATE-PALMOLIVE COMPANY,0,US,New York,NY,New York County,A,2,2,1,1,oqd48eh5qnqj4ghh6gl8noz33,1,John E. Pedergrass,fl:cy_ln:wichman-1,0,Cynthia A. Wichman,,,,,,,,,,,,,,,,,,,,,,0
4180870,1980,05/676879,1976,1,1,1,1,1,FA WILH. JUL. TEUFEL,0,DE,Stuttgart,,,A,3,3,3,0,fl:ra_ln:radulovic-2,1,Radoje Radulovic,bj0zl4z4ab7cppmiw4oh8m5vx,1,Mustafa Karisik,fl:kl_ln:wolfer-2,1,Klaus R. Wolfer,,,,,,,,,,,,,,,,,,,0
4180871,1980,05/847841,1977,1,0,0,1,1,,0,,,,,A,1,1,1,0,fl:ro_ln:hamas-1,1,Robert S. Hamas,,,,,,,,,,,,,,,,,,,,,,,,,
4180872,1980,05/855370,1977,1,0,0,1,1,,0,,,,,A,1,1,1,0,0804gl64thfu0vjgwfmo9v18m,1,Neal S. Chaikin,,,,,,,,,,,,,,,,,,,,,,,,,
4180873,1980,05/748233,1976,1,0,0,1,1,,0,,,,,A,1,1,1,0,fl:ir_ln:fixel-1,1,Irving E. Fixel,,,,,,,,,,,,,,,,,,,,,,,,,
4180874,1980,05/885934,1978,1,1,1,1,1,OWENS-CORNING FIBERGLAS CORPORATION,0,US,Toledo,OH,Lucas,A,2,1,1,0,fl:me_ln:seymour-1,1,Merritt W. Seymour,fl:ja_ln:jones-37,,James E. Jones,,,,,,,,,,,,,,,,,,,,,,0
4180875,1980,05/906415,1978,1,0,0,1,1,,0,,,,,E,1,1,1,0,fl:po_ln:wilson-1,1,Porter C. Wilson,,,,,,,,,,,,,,,,,,,,,,,,,
4180876,1980,05/957799,1978,1,1,1,1,1,THETFORD CORPORATION,0,US,Ann Arbor,MI,Washtenaw,E F,5,5,4,1,fl:fr_ln:sargent-2,1,Frank T. Sargent,fl:jo_ln:antos-3,1,John M. Antos,fl:ar_ln:henke-2,1,Arthur W. Henke,fl:jo_ln:hoffman-26,1,John A. Hoffman,fl:er_ln:lindsay-2,0,Erin J. Lindsay,,,,,,,,,,,,,0
4180877,1980,05/944914,1978,1,1,1,1,1,"LEGGETT & PLATT, INCORPORATED",0,US,Carthage,MO,Jasper,A,1,1,1,0,fl:la_ln:higgins-10,1,Larry Higgins,,,,,,,,,,,,,,,,,,,,,,,,,0
4180878,1980,05/881357,1978,1,0,0,1,1,,0,,,,,A,1,1,0,1,fl:di_ln:howell-2,0,Dione H. Howell,,,,,,,,,,,,,,,,,,,,,,,,,
4180879,1980,05/930990,1978,1,0,0,1,1,,0,,,,,A,1,1,1,0,fl:ro_ln:mann-30,1,Rose A. Mann,,,,,,,,,,,,,,,,,,,,,,,,,
4180880,1980,05/841946,1977,1,1,1,1,1,BLEICHE AG ZOFINGEN,0,CH,Zofingen,,,D,1,1,1,0,fl:vi_ln:stritzko-1,1,Vilem Stritzko,,,,,,,,,,,,,,,,,,,,,,,,,0
4180881,1980,05/869957,1978,1,0,0,1,1,,0,,,,,B,1,1,1,0,fl:ja_ln:speranza-1,1,James L. Speranza,,,,,,,,,,,,,,,,,,,,,,,,,
4180882,1980,05/822404,1977,1,0,0,1,1,,0,,,,,B,1,1,1,0,fl:mo_ln:kawasaki-11,1,Motojiro Kawasaki,,,,,,,,,,,,,,,,,,,,,,,,,
4180883,1980,05/860197,1977,1,1,1,1,1,BEAUFORT AIR-SEA EQUIPMENT LTD.,0,GB,Grafton,,,B,1,1,1,0,fl:wa_ln:oldham-1,1,Walter Oldham,,,,,,,,,,,,,,,,,,,,,,,,,0
4180884,1980,05/959431,1978,1,0,0,1,1,,0,,,,,A,2,2,1,1,fl:do_ln:hess-11,1,Don H. Hess,fl:jo_ln:hess-22,0,JoAnna B. Hess,,,,,,,,,,,,,,,,,,,,,,
4180885,1980,05/800694,1977,1,1,1,1,1,FRAM CORPORATION,0,US,Providence,RI,Providence County,B,2,2,2,0,fl:do_ln:thornton-11,1,Donald I. Thornton,fl:ri_ln:peyton-1,1,Richard H. Peyton,,,,,,,,,,,,,,,,,,,,,,0
4180886,1980,05/928915,1978,1,0,0,1,1,,0,,,,,B,1,1,1,0,fl:wi_ln:scherz-1,1,Wilhelm Scherz,,,,,,,,,,,,,,,,,,,,,,,,,
4180887,1980,05/869855,1978,1,1,1,1,1,VORWERK & CO. INTERHOLDING GMBH,0,DE,Wuppertal,,,A,2,2,2,0,dro444ztkyzzm5bavp60jy12a,1,Egon Wudel,fl:ge_ln:haase-1,1,Georg Haase,,,,,,,,,,,,,,,,,,,,,,0
4180888,1980,05/886584,1978,1,1,1,1,1,TOKICO LTD.,0,JP,Yokohama,,,E,1,1,1,0,fl:to_ln:nagase-13,1,Toshiro Nagase,,,,,,,,,,,,,,,,,,,,,,,,,0
4180889,1980,05/930134,1978,1,0,0,1,1,,0,,,,,A,1,1,1,0,fl:ed_ln:joffe-1,1,Edward J. Joffe,,,,,,,,,,,,,,,,,,,,,,,,,
4180890,1980,05/793652,1977,1,1,1,1,1,"INGRIP FASTENERS, INC.",0,US,Montclair,NJ,Essex,A B D,1,1,1,0,fl:ge_ln:brumlik-1,1,George C. Brumlik,,,,,,,,,,,,,,,,,,,,,,,,,0
4180891,1980,05/969696,1978,1,1,1,1,1,SCHAEFFER-HOMBERG GMBH,0,DE,Wuppertal,,,A,1,1,1,0,fl:al_ln:stocker-2,1,Alberto Stocker,,,,,,,,,,,,,,,,,,,,,,,,,0
4180892,1980,05/897373,1978,1,1,1,1,1,A/S BRUEL & KJAER,0,DK,Hadsten,,,H,1,1,1,0,fl:jo_ln:jensen-53,1,Jorgen Jensen,,,,,,,,,,,,,,,,,,,,,,,,,0
4180893,1980,05/921640,1978,1,1,1,1,1,HONEYWELL INFORMATION SYSTEMS INC.,0,US,Phoenix,AZ,Maricopa,B,1,1,1,0,fl:ma_ln:avalon-1,1,Max Avalon,,,,,,,,,,,,,,,,,,,,,,,,,0
4180894,1980,05/929726,1978,1,1,1,1,1,INDEX-WERKE GMBH & CO. KG HAHN & TESSKY,0,DE,Jeffery Road,,,B,1,1,1,0,fl:he_ln:link-3,1,Helmut F. Link,,,,,,,,,,,,,,,,,,,,,,,,,0
4180895,1980,05/900374,1978,1,1,1,1,1,VANDERVELL PRODUCTS LIMITED,0,GB,Maidenhead,,,B,2,2,2,0,fl:ro_ln:spikes-2,1,Roger H. Spikes,fl:wi_ln:blackburn-3,1,William J. Blackburn,,,,,,,,,,,,,,,,,,,,,,0
4180896,1980,05/952020,1978,1,1,1,1,1,"TEXAS MEDICAL PRODUCTS, INC.",0,US,Houston,TX,Harris County,A,3,3,3,0,fl:ch_ln:reed-6,1,Charles C. Reed,fl:de_ln:cooley-1,1,Denton A. Cooley,fl:ru_ln:sharp-1,1,Russell G. Sharp,,,,,,,,,,,,,,,,,,,0
4180897,1980,05/942474,1978,1,0,0,1,1,,0,,,,,B,1,1,1,0,stskmmbkys32ihnuuqsog5xgw,1,Dwight H. Chester,,,,,,,,,,,,,,,,,,,,,,,,,
4180898,1980,05/918388,1978,1,1,1,1,1,CAMPH ENGINEERING COMPANY AB,0,SE,Malmö,,,B,2,2,2,0,fl:sv_ln:camph-1,1,Sven E. Camph,fl:be_ln:holmgren-1,1,Bertil Holmgren,,,,,,,,,,,,,,,,,,,,,,0
4180899,1980,05/823034,1977,1,0,0,1,1,,0,,,,,B,1,1,1,0,l36pe8jpb7ajfysxa8atzr1by,1,Ronald M. Mikosinski,,,,,,,,,,,,,,,,,,,,,,,,,
4180900,1980,05/883870,1978,1,1,1,1,1,ITT CORPORATION,0,US,New York,NY,New York County,H,1,1,1,0,fl:ot_ln:klein-3,1,Otto Klein,,,,,,,,,,,,,,,,,,,,,,,,,0
4180901,1980,05/879828,1978,1,1,1,1,1,TEXAS INSTRUMENTS INCORPORATED,0,US,Dallas,TX,Dallas County,H,1,1,1,0,fl:be_ln:kulwicki-1,1,Bernard M. Kulwicki,,,,,,,,,,,,,,,,,,,,,,,,,0
4180902,1980,05/898348,1978,1,1,1,1,1,WESTINGHOUSE ELECTRIC CORP.,0,US,Pittsburgh,PA,Allegheny,F,1,1,1,0,fl:ro_ln:dunn-19,1,Robert E. Dunn,,,,,,,,,,,,,,,,,,,,,,,,,0
4180903,1980,05/882674,1978,1,0,0,1,1,,0,,,,,B,1,1,1,0,fl:jo_ln:hannigan-3,1,Joseph F. Hannigan,,,,,,,,,,,,,,,,,,,,,,,,,
4180904,1980,05/768578,1977,1,1,1,1,1,BUNKER RAMO CORPORATION,0,US,Oak Brook,IL,DuPage,H,1,1,1,0,fl:jo_ln:nijman-1,1,John P. Nijman,,,,,,,,,,,,,,,,,,,,,,,,,0
4180905,1980,05/893086,1978,1,1,1,1,1,"AGFA-GEVAERT, A.G.",0,DE,Leverkusen,,,B,2,2,1,1,fl:ra_ln:klinkhammer-1,1,Ralf L. Klinkhammer,fl:ar_ln:klotz-3,0,Artur Klotz,,,,,,,,,,,,,,,,,,,,,,0
4180906,1980,05/847413,1977,1,0,0,1,1,,0,,,,,B,1,1,1,0,fl:ru_ln:may-7,1,Russell May,,,,,,,,,,,,,,,,,,,,,,,,,
4180907,1980,05/895551,1978,1,1,1,1,1,AMERICAN SAFETY RAZOR COMPANY,0,US,Verona,VA,Augusta,B,1,1,1,0,fl:cl_ln:iten-1,1,Clemens A. Iten,,,,,,,,,,,,,,,,,,,,,,,,,0
4180908,1980,05/878077,1978,1,1,1,1,1,MARTOR-ARGENTAX E.H. BEERMANN KG,0,DE,Solingen,,,B,1,1,1,0,fl:ew_ln:beermann-1,1,Ewald H. Beermann,,,,,,,,,,,,,,,,,,,,,,,,,0
4180909,1980,05/886375,1978,1,0,0,1,1,,0,,,,,B,1,1,1,0,fl:an_ln:lind-1,1,Anders Lind,,,,,,,,,,,,,,,,,,,,,,,,,
4180910,1980,05/951242,1978,1,1,1,1,1,STRAUMANN HOLDING AG,0,CH,,,,A,2,2,2,0,fl:fr_ln:straumann-2,1,Fritz Straumann,fl:fr_ln:sutter-3,1,Franz Sutter,,,,,,,,,,,,,,,,,,,,,,0
4180911,1980,05/833717,1977,1,1,1,1,1,"APPLIED SCIENCES, INC.",0,US,Chicago,IL,Cook County,A C,1,1,1,0,fl:ri_ln:bullock-1,1,Richard S. Bullock,,,,,,,,,,,,,,,,,,,,,,,,,0
4180912,1980,05/944742,1978,1,0,0,1,1,,0,,,,,A,1,1,1,0,fl:pe_ln:kesling-1,1,Peter C. Kesling,,,,,,,,,,,,,,,,,,,,,,,,,
4180913,1980,05/851080,1977,1,1,1,1,1,MITSUHARU SHIMURA,0,JP,Tokyo,,,C,3,3,3,0,fl:mi_ln:takeuchi-18,1,Mitsuharu Takeuchi,fl:sa_ln:hayashi-9,1,Satoshi Hayashi,fl:is_ln:minemoto-2,1,Isao Minemoto,,,,,,,,,,,,,,,,,,,1
4180914,1980,05/911215,1978,1,0,0,1,1,,0,,,,,G,1,1,1,0,fl:he_ln:lechner-2,1,Helmut Lechner,,,,,,,,,,,,,,,,,,,,,,,,,
4180915,1980,05/889167,1978,1,1,1,1,1,FMC CORPORATION,0,US,San Jose,CA,Santa Clara,G,2,2,2,0,fl:me_ln:lill-1,1,Melvin H. Lill,fl:ja_ln:wiederrich-1,1,James L. Wiederrich,,,,,,,,,,,,,,,,,,,,,,0
4180916,1980,05/818835,1977,1,1,1,1,1,S. G. BROWN LIMITED,0,GB,Watford,,,G,1,1,1,0,fl:da_ln:brook-3,1,David L. Brook,,,,,,,,,,,,,,,,,,,,,,,,,0
4180917,1980,05/939745,1978,1,1,1,1,1,ROHM AND HAAS COMPANY,0,US,Philadelphia,PA,Philadelphia,F,1,1,1,0,fl:cl_ln:neubeck-1,1,Clifford E. Neubeck,,,,,,,,,,,,,,,,,,,,,,,,,0
4180918,1980,05/949324,1978,1,1,1,1,1,CATERPILLAR TRACTOR CO.,0,US,Peoria,IL,Peoria County,F,1,1,1,0,fl:ri_ln:ostrowski-1,1,Richard C. Ostrowski,,,,,,,,,,,,,,,,,,,,,,,,,0
4180919,1980,05/842493,1977,1,0,0,1,1,,0,,,,,F,1,1,1,0,fl:ha_ln:baltes-2,1,Hans Baltes,,,,,,,,,,,,,,,,,,,,,,,,,
4180920,1980,05/862134,1977,1,1,1,1,1,HITACHI HIGH-TECHNOLOGIES CORPORATION,0,JP,Tokyo,,,G,2,2,2,0,kdclt53bh4wmm24z4qmxukkcp,1,Morio Ubukata,fl:hi_ln:kida-6,1,Hideki Kida,,,,,,,,,,,,,,,,,,,,,,0
4180921,1980,05/939391,1978,1,1,1,1,1,TEXTRON INC.,0,US,Rochester,NY,Monroe,G,2,2,2,0,fl:be_ln:elbaum-1,1,Bernard M. Elbaum,kgl11x60jazaqj49fysjxy1d0,1,Engel Harvey,,,,,,,,,,,,,,,,,,,,,,0
4180922,1980,05/875815,1978,1,0,0,1,1,,0,,,,,A,2,2,2,0,fl:st_ln:cieslak-1,1,Stanley Cieslak,fl:le_ln:cieslak-1,1,Leonard K. Cieslak,,,,,,,,,,,,,,,,,,,,,,
4180923,1980,05/884484,1978,1,0,0,1,1,,0,,,,,A,1,1,1,0,fl:ad_ln:dassler-1,1,Adolf Dassler,,,,,,,,,,,,,,,,,,,,,,,,,
4180924,1980,05/908344,1978,1,1,1,1,1,"BROOKS SHOE MANUFACTURING CO., INC.",0,US,Philadelphia,PA,Philadelphia,A,1,1,1,0,k8o5ms4avgle69uwv9tlhsb2z,1,Steven I. Subotnick,,,,,,,,,,,,,,,,,,,,,,,,,0
4180925,1980,05/884080,1978,1,1,1,1,1,CATERPILLAR TRACTOR CO.,0,US,Peoria,IL,Peoria County,E,1,1,1,0,fl:wa_ln:richardson-1,1,Warner G. Richardson,,,,,,,,,,,,,,,,,,,,,,,,,0
4180926,1980,05/874725,1978,1,1,1,1,1,CATERPILLAR TRACTOR CO.,0,US,Peoria,IL,Peoria County,E,2,2,2,0,fl:ge_ln:klett-1,1,Gene R. Klett,fl:wi_ln:lanz-1,1,William E. Lanz,,,,,,,,,,,,,,,,,,,,,,0
4180927,1980,05/904385,1978,1,1,1,1,1,UNIT RIG & EQUIPMENT CO.,0,US,Tulsa,OK,Tulsa County,E,1,1,1,0,fl:ch_ln:satterwhite-1,1,Charles R. Satterwhite,,,,,,,,,,,,,,,,,,,,,,,,,0
4180928,1980,05/925060,1978,1,1,1,1,1,GENERAL ELECTRIC COMPANY,0,US,New York,NY,New York County,D,1,1,1,0,fl:wi_ln:davidson-15,1,William E. Davidson,,,,,,,,,,,,,,,,,,,,,,,,,0
4180929,1980,05/871361,1978,1,1,1,1,1,MINNESOTA MINING AND MANUFACTURING COMPANY,0,US,Windom,MN,Cottonwood,G,1,1,1,0,fl:th_ln:schultz-5,1,Thomas E. Schultz,,,,,,,,,,,,,,,,,,,,,,,,,0
4180930,1980,05/825952,1977,1,1,1,1,1,SOLID PHOTOGRAPHY INC.,0,US,Melville,NY,Suffolk County,G,1,1,1,0,fl:pa_ln:dimatteo-3,1,Paul DiMatteo,,,,,,,,,,,,,,,,,,,,,,,,,0
4180931,1980,05/840825,1977,1,0,0,1,1,,0,,,,,G,1,1,1,0,9jt5yyb7f1vtojsjvh87xniws,1,John V. Osch,,,,,,,,,,,,,,,,,,,,,,,,,
4180932,1980,05/685506,1976,1,0,0,1,1,,0,,,,,A,1,1,1,0,jt8kbj328c7l1ai46suau5mjp,1,Irving I. Millard,,,,,,,,,,,,,,,,,,,,,,,,,
4180933,1980,05/822077,1977,1,0,0,1,1,,0,,,,,G,1,1,1,0,uojim9pmov5o4svbl5ljk5vjb,1,Georges A. Chammah,,,,,,,,,,,,,,,,,,,,,,,,,
4180934,1980,05/786794,1977,1,0,0,1,1,,0,,,,,G,1,0,0,0,fl:se_ln:cohen-5,,Seymour Cohen,,,,,,,,,,,,,,,,,,,,,,,,,
4180935,1980,05/828486,1977,1,1,1,1,1,MASSACHUSETTS INSTITUTE OF TECHNOLOGY,0,US,Cambridge,MA,Middlesex,A,1,1,1,0,fl:cl_ln:goudey-1,1,Clifford A. Goudey,,,,,,,,,,,,,,,,,,,,,,,,,0
4180936,1980,05/889227,1978,1,0,0,1,1,,0,,,,,A,1,1,1,0,fl:le_ln:davis-29,1,Lester M. Davis,,,,,,,,,,,,,,,,,,,,,,,,,
4180937,1980,05/911436,1978,1,0,0,1,1,,0,,,,,A,1,1,1,0,fl:ja_ln:webster-20,1,Jady Webster,,,,,,,,,,,,,,,,,,,,,,,,,
4180939,1980,05/853913,1977,1,1,1,1,1,KABUSHIKI KAISHA MATSUSHIRO,0,JP,Tokyo,,,A,1,0,0,0,fl:yu_ln:matsushiro-2,,Yukimitsu Matsushiro,,,,,,,,,,,,,,,,,,,,,,,,,0
4180940,1980,05/941409,1978,1,0,0,1,1,,0,,,,,A,1,1,1,0,y2rqb729gsksznb6gy4o4rc2z,1,Walter E. McMasters,,,,,,,,,,,,,,,,,,,,,,,,,
4180941,1980,05/854971,1977,1,0,0,1,1,,0,,,,,A,1,1,1,0,lx7scl6pyrzo83no8tqv2m7d7,1,Joe Korematsu,,,,,,,,,,,,,,,,,,,,,,,,,
4180942,1980,05/929672,1978,1,0,0,1,1,,0,,,,,E,1,1,1,0,fl:er_ln:saucier-2,1,Ernest Saucier,,,,,,,,,,,,,,,,,,,,,,,,,
4180943,1980,05/942879,1978,1,1,1,1,1,MCDONNELL DOUGLAS CORPORATION,0,US,Long Beach,CA,Los Angeles,E,2,1,1,0,fl:hu_ln:smith-11,,Hugh Smith,fl:da_ln:blackmore-3,1,David M. Blackmore,,,,,,,,,,,,,,,,,,,,,,0
4180944,1980,05/956359,1978,1,1,1,1,1,"THE VOLLRATH COMPANY, INC.",0,US,Sheboygan,WI,Sheboygan,E,2,1,1,0,fl:wi_ln:stowik-1,1,William J. Stowik,fl:ke_ln:kaiser-6,,Kenneth L. Kaiser,,,,,,,,,,,,,,,,,,,,,,0
4180945,1980,05/847830,1977,1,0,0,1,1,,0,,,,,B,1,1,1,0,fl:ph_ln:zimmerman-5,1,Philip R. Zimmerman,,,,,,,,,,,,,,,,,,,,,,,,,
4180946,1980,05/883213,1978,1,0,0,1,1,,0,,,,,B,6,6,6,0,fl:ma_ln:heijkenskjold-1,1,Mats Heijkenskjold,fl:ol_ln:hedberg-1,1,Olle Hedberg,fl:ve_ln:klaassen-1,1,Vello Klaassen,fl:st_ln:larsson-2,1,Sture Larsson,fl:he_ln:habermann-3,1,Helmut Habermann,fl:ma_ln:brunet-6,1,Maurice Brunet,,,,,,,,,,
4180947,1980,05/868108,1978,1,1,1,1,1,CINCINNATI MILACRON INC.,0,US,Cincinnati,OH,Hamilton,B,2,2,2,0,fl:di_ln:schmidt-16,1,Dieter Schmidt,tx2ys4dk1u9fenkiyfiokkrms,1,Dean H. Garman,,,,,,,,,,,,,,,,,,,,,,0
4180948,1980,05/815906,1977,1,0,0,1,1,,0,,,,,B,1,1,1,0,fl:wo_ln:stoltz-1,1,Woodrow W. Stoltz,,,,,,,,,,,,,,,,,,,,,,,,,
4180949,1980,05/922632,1978,1,0,0,1,1,,0,,,,,B E,1,1,1,0,fl:ea_ln:draper-1,1,"Earle S. Draper, Jr.",,,,,,,,,,,,,,,,,,,,,,,,,
4180950,1980,05/874403,1978,1,1,1,1,1,ANNAN BLAIR,1,CA,Ottawa,ON,,E,1,1,1,0,fl:wi_ln:foster-27,1,Wilbert J. Foster,,,,,,,,,,,,,,,,,,,,,,,,,0
4180951,1980,05/857265,1977,1,1,1,1,1,GESELLSCHAFT ZUR FORDERUNG DER FORSCHUNG AN DER EIDGENOSSISCHEN TECHNISCHEN HOCHSCHULE,0,CH,Zürich,,,E,1,1,1,0,wssprw0iemm73yht1orb8dilv,1,Willi Francioni,,,,,,,,,,,,,,,,,,,,,,,,,0
4180952,1980,05/882579,1978,1,0,0,1,1,,0,,,,,E,1,1,1,0,fl:do_ln:vanderlyn-1,1,Donald Vanderlyn,,,,,,,,,,,,,,,,,,,,,,,,,
4180953,1980,05/751794,1976,1,0,0,1,1,,0,,,,,E,3,3,3,0,fl:di_ln:moraru-2,1,Dinu S. Moraru,9zkhu6rbmk5ly3d7wo1xolfwu,1,Ion Tetcu,nlfzyrj9zz2867bx0hcegxsmp,1,Constantin Mihaescu,,,,,,,,,,,,,,,,,,,
4180954,1980,05/895055,1978,1,0,0,1,1,,0,,,,,E G,1,1,1,0,fl:ha_ln:gell-1,1,"Harold A. Gell, Jr.",,,,,,,,,,,,,,,,,,,,,,,,,
4180955,1980,05/847593,1977,1,0,0,1,1,,0,,,,,E H,1,1,1,0,1v99wk1yipgtcl2h9opxo4wqr,1,Paul Krstich,,,,,,,,,,,,,,,,,,,,,,,,,
4180956,1980,05/891396,1978,1,0,0,1,1,,0,,,,,E,1,1,1,0,t1xkln4dwcy4d93nora9luskr,1,Fernand Gross,,,,,,,,,,,,,,,,,,,,,,,,,
4180957,1980,05/953219,1978,1,1,1,1,1,GENERAL MOTORS CORPORATION,0,US,Detroit,MI,Wayne,E,1,1,1,0,cjod4pkb47twxso2dh7ahl9u3,1,Charles W. Rantala,,,,,,,,,,,,,,,,,,,,,,,,,0
4180958,1980,05/855781,1977,1,0,0,1,1,,0,,,,,E,1,1,1,0,fl:ke_ln:brody-2,1,Kenneth I. Brody,,,,,,,,,,,,,,,,,,,,,,,,,
4180959,1980,05/933283,1978,1,0,0,1,1,,0,,,,,B,2,2,2,0,fl:ro_ln:hempel-6,1,"Robert P. Hempel, Jr.",fl:el_ln:rondelli-2,1,Elder Rondelli,,,,,,,,,,,,,,,,,,,,,,
4180960,1980,05/664373,1976,1,1,1,1,1,GEORGE WASSERMAN,1,US,Brookline,MA,Norfolk,B,2,2,2,0,fl:ge_ln:wasserman-3,1,George Wasserman,fl:jo_ln:bushee-1,1,Joseph J. Bushee,,,,,,,,,,,,,,,,,,,,,,0
4180961,1980,05/903721,1978,1,1,1,1,1,ALUMINUM COMPANY OF AMERICA,0,US,Pittsburgh,PA,Allegheny,B,1,1,1,0,fl:jo_ln:collins-23,1,"John W. Collins, III",,,,,,,,,,,,,,,,,,,,,,,,,0
4180962,1980,05/931781,1978,1,1,1,1,1,RELIANCE ELECTRIC COMPANY,0,US,Cleveland,OH,Cuyahoga,B,1,1,1,0,fl:ch_ln:michels-2,1,Charles E. Michels,,,,,,,,,,,,,,,,,,,,,,,,,0
4180963,1980,05/894353,1978,1,0,0,1,1,,0,,,,,B,1,1,1,0,fl:ro_ln:anderson-72,1,Robert P. Anderson,,,,,,,,,,,,,,,,,,,,,,,,,
4180964,1980,05/784164,1977,1,0,0,1,1,,0,,,,,A,1,1,1,0,6kjr4ptsbpzragj45xcd20gut,1,Dino G. Pansire,,,,,,,,,,,,,,,,,,,,,,,,,
4180965,1980,05/934043,1978,1,0,0,1,1,,0,,,,,A,1,1,1,0,t0hw6oni6rsp73l8r9e57c59w,1,Matt Vedvig,,,,,,,,,,,,,,,,,,,,,,,,,
4180966,1980,05/946919,1978,1,1,1,1,1,PIETRO LAVERDA S.P.A.,0,IT,Thiene,,,A,1,1,1,0,fl:ma_ln:zen-3,1,Marcello Zen,,,,,,,,,,,,,,,,,,,,,,,,,0
4180967,1980,05/886802,1978,1,1,1,1,1,HAMEL GMBH ZWIRNMASCHINEN,0,DE,Munster,,,D,2,2,2,0,fl:al_ln:greive-1,1,Aloys Greive,fl:al_ln:horstmann-1,1,Aloys Horstmann,,,,,,,,,,,,,,,,,,,,,,0
4180968,1980,05/845922,1977,1,1,1,1,1,COURTAULDS LIMITED,0,GB,London,,,D,1,0,0,0,fl:br_ln:white-73,,Breen C. White,,,,,,,,,,,,,,,,,,,,,,,,,0
4180969,1980,05/830936,1977,1,1,1,1,1,KABUSHIKI KAISHA SUWA SEIKOSHA,0,JP,Tokyo,,,G,1,0,0,0,fl:ok_ln:naito-1,,Okito Naito,,,,,,,,,,,,,,,,,,,,,,,,,0
4180970,1980,05/813398,1977,1,1,1,1,1,KABUSHIKI KAISHA SUWA SEIKOSHA,0,JP,Tokyo,,,G,3,3,3,0,fl:ik_ln:tokunaga-1,1,Ikuo Tokunaga,fl:hi_ln:uchiyama-18,1,Hideaki Uchiyama,fl:yo_ln:fujimori-13,1,Yoshiaki Fujimori,,,,,,,,,,,,,,,,,,,0
4180971,1980,05/900888,1978,1,0,0,1,1,,0,,,,,F,1,1,1,0,fl:be_ln:klinke-2,1,Bernhard R. Klinke,,,,,,,,,,,,,,,,,,,,,,,,,
4180972,1980,05/913744,1978,1,1,1,1,1,GENERAL MOTORS CORPORATION,0,US,Detroit,MI,Wayne,F,2,2,1,1,fl:av_ln:herman-1,0,Avrum S. Herman,fl:sa_ln:reider-1,1,Samuel B. Reider,,,,,,,,,,,,,,,,,,,,,,0
4180973,1980,05/858015,1977,1,1,1,1,1,KERNFORSCHUNGSANLAGE JULICH GESELLSCHAFT MIT BESCHRANKTER HAFTUNG,0,DE,Jülich,,,F,3,3,3,0,fl:si_ln:forster-4,1,Siegfried Forster,fl:gu_ln:hewing-2,1,Gunther Hewing,fl:ma_ln:kleeman-1,1,Manfred Kleeman,,,,,,,,,,,,,,,,,,,0
4180974,1980,05/847459,1977,1,1,1,1,1,GENERAL ELECTRIC COMPANY,0,US,Cincinnati,OH,Hamilton,F,3,3,3,0,fl:ri_ln:stenger-1,1,Richard E. Stenger,fl:ed_ln:ekstedt-1,1,Edward E. Ekstedt,fl:st_ln:seto-1,1,Stanford P. Seto,,,,,,,,,,,,,,,,,,,0
4180975,1980,05/863693,1977,1,1,1,1,1,"NISSAN MOTOR CO., LTD.",0,JP,Yokohama,,,F,2,1,1,0,fl:ya_ln:takagi-12,,Yasuo Takagi,fl:ka_ln:katoh-31,1,Kazumasa Katoh,,,,,,,,,,,,,,,,,,,,,,0
4180976,1980,05/900570,1978,1,0,0,1,1,,0,,,,,F,1,1,1,0,fl:ca_ln:bunn-2,1,Carl H. Bunn,,,,,,,,,,,,,,,,,,,,,,,,,
4180977,1980,05/954971,1978,1,1,1,1,1,GENERAL MOTORS CORPORATION,0,US,Detroit,MI,Wayne,F,1,1,1,0,fl:jo_ln:beardmore-2,1,John M. Beardmore,,,,,,,,,,,,,,,,,,,,,,,,,0
4180978,1980,05/950595,1978,1,1,1,1,1,GENERAL MOTORS CORPORATION,0,US,Detroit,MI,Wayne,F,1,1,1,0,fl:do_ln:maddock-2,1,Don G. Maddock,,,,,,,,,,,,,,,,,,,,,,,,,0
4180979,1980,05/918117,1978,1,1,1,1,1,EATON CORPORATION,0,US,Cleveland,OH,Cuyahoga,F,1,1,1,0,fl:ch_ln:cornell-5,1,Charles R. Cornell,,,,,,,,,,,,,,,,,,,,,,,,,0
4180980,1980,05/884106,1978,1,0,0,1,1,,0,,,,,F,2,2,1,1,fl:ro_ln:marks-21,0,Ronald Marks,fl:jo_ln:dorius-1,1,John O. Dorius,,,,,,,,,,,,,,,,,,,,,,
4180981,1980,05/900905,1978,1,1,1,1,1,MASSEY-FERGUSON SERVICES N.V.,0,NL,Willemstad,,,F,1,1,1,0,fl:ca_ln:pensa-1,1,Carlo Pensa,,,,,,,,,,,,,,,,,,,,,,,,,0
4180982,1980,05/779709,1977,1,0,0,1,1,,0,,,,,F,1,1,1,0,fl:is_ln:siegel-1,1,Israel Siegel,,,,,,,,,,,,,,,,,,,,,,,,,
4180983,1980,05/895178,1978,1,1,1,1,1,ALSTHOM-ATLANTIQUE,0,FR,Paris,,,F,2,2,2,0,l8aud21zr0n7kkjppcltkkimv,1,Pierre Maginot,gxmpkowgpzp4o1rglj9w1f4er,1,Roger Le Peutrec,,,,,,,,,,,,,,,,,,,,,,0
4180984,1980,05/866148,1977,1,1,1,1,1,HELIX TECHNOLOGY CORPORATION,0,US,Waltham,MA,Middlesex,F,1,1,1,0,fl:fr_ln:chellis-1,1,Fred F. Chellis,,,,,,,,,,,,,,,,,,,,,,,,,0
4180985,1980,05/856400,1977,1,1,1,1,1,"NORTHRUP, INC.",0,US,Hutchins,TX,Dallas,F,1,1,0,1,fl:ly_ln:northrup-1,0,"Lynn L. Northrup, Jr.",,,,,,,,,,,,,,,,,,,,,,,,,0
4180986,1980,05/900025,1978,1,1,1,1,1,"DUNHAM-BUSH, INC.",0,US,Town of West Hartford,CT,Hartford,F,1,1,1,0,fl:da_ln:shaw-24,1,David N. Shaw,,,,,,,,,,,,,,,,,,,,,,,,,0
4180987,1980,05/832168,1977,1,1,1,1,1,THE STOUFFER CORPORATION,0,US,Solon,OH,Cuyahoga,B F,1,1,1,0,fl:th_ln:mclaughlin-10,1,Thomas McLaughlin,,,,,,,,,,,,,,,,,,,,,,,,,0
4180988,1980,05/888140,1978,1,0,0,1,1,,0,,,,,F,2,2,2,0,ymmmfp4buayct0fsi8mk6rfeh,1,Jimmy L. Forte,fl:cr_ln:lindsay-4,1,Creo B. Lindsay,,,,,,,,,,,,,,,,,,,,,,
4180989,1980,05/883591,1978,1,1,1,1,1,LEMFORDER METALLWAREN AG,0,DE,,,,F,1,1,1,0,fl:gu_ln:lange-8,1,Gunther Lange,,,,,,,,,,,,,,,,,,,,,,,,,0
4180990,1980,05/932923,1978,1,1,1,1,1,BURROUGHS CORPORATION,0,US,Detroit,MI,Wayne,F,1,0,0,0,fl:te_ln:hill-6,,Terence A. Hill,,,,,,,,,,,,,,,,,,,,,,,,,0
4180991,1980,05/853709,1977,1,1,1,1,1,COSTRUZIONI MECCANICHE LONATI S.P.A.,0,IT,Brescia,,,D,1,1,1,0,fl:fr_ln:lonati-1,1,Francesco Lonati,,,,,,,,,,,,,,,,,,,,,,,,,0
4180992,1980,05/914716,1978,1,1,1,1,1,RUDOLF SCHIEBER GMBH,0,DE,Lauchheim,,,D,1,1,1,0,fl:ha_ln:schieber-1,1,Hans Schieber,,,,,,,,,,,,,,,,,,,,,,,,,0
4180993,1980,05/950727,1978,1,0,0,1,1,,0,,,,,D,1,1,1,0,fl:mo_ln:philip-3,1,Morris Philip,,,,,,,,,,,,,,,,,,,,,,,,,
4180994,1980,05/932315,1978,1,1,1,1,1,UNIVERSAL TOWEL COMPANY LIMITED,0,GB,Warwick,,,D,2,2,2,0,fl:ma_ln:lemon-4,1,Maurice C. Lemon,fl:jo_ln:spear-4,1,John Spear,,,,,,,,,,,,,,,,,,,,,,0
4180995,1980,05/860094,1977,1,0,0,1,1,,0,,,,,D,1,1,0,1,fl:ar_ln:meyer-16,0,Arnfried Meyer,,,,,,,,,,,,,,,,,,,,,,,,,
4180996,1980,05/916877,1978,1,1,1,1,1,MASTER LOCK COMPANY LLC,0,US,Milwaukee,WI,Milwaukee County,E,1,1,1,0,fl:ho_ln:lebrecht-1,1,Horst Lebrecht,,,,,,,,,,,,,,,,,,,,,,,,,0
4180997,1980,05/896758,1978,1,1,1,1,1,APPLIED POWER INC.,0,US,Milwaukee,WI,Milwaukee County,B,1,1,1,0,fl:ra_ln:evenson-2,1,Raymond M. Evenson,,,,,,,,,,,,,,,,,,,,,,,,,0
4180998,1980,05/892184,1978,1,1,1,1,1,OY WARTSILA AB,0,FI,Helsinki,,,B,1,1,1,0,fl:er_ln:hellman-3,1,Erkki Hellman,,,,,,,,,,,,,,,,,,,,,,,,,0
4180999,1980,05/924082,1978,1,1,1,1,1,OY WARTSILA AB,0,FI,Helsinki,,,E,2,2,2,0,fl:oi_ln:hurskainen-1,1,Oiva Hurskainen,fl:fr_ln:kiraly-1,1,Franz Kiraly,,,,,,,,,,,,,,,,,,,,,,0
4181000,1980,05/839243,1977,1,1,1,1,1,ROCKWELL INTERNATIONAL CORPORATION,0,US,El Segundo,CA,Los Angeles,B,3,3,3,0,fl:c._ln:hamilton-3,1,C. Howard Hamilton,fl:ne_ln:paton-1,1,Neil E. Paton,fl:jo_ln:curnow-1,1,John M. Curnow,,,,,,,,,,,,,,,,,,,0
4181001,1980,05/891916,1978,1,1,1,1,1,VYZKUMNY USTAV TVARECICH STROJU A TECHNOLOGIE TVARENI,0,CZ,Brno,,,B,2,1,1,0,fl:ja_ln:zalesak-1,1,Jan Zalesak,fl:mi_ln:bednar-3,,Miloslav Bednar,,,,,,,,,,,,,,,,,,,,,,0
4181002,1980,05/825916,1977,1,1,1,1,1,WALTER ECKOLD VORRICHTUNGS U. GERATEBAU SPERRLUTTERTAL,0,DE,Braunlage,,,B,2,2,2,0,fl:ge_ln:eckold-2,1,Gerd-Jurgen Eckold,fl:ha_ln:maass-3,1,Hans Maass,,,,,,,,,,,,,,,,,,,,,,0
4181003,1980,05/941592,1978,1,0,0,1,1,,0,,,,,B,5,5,5,0,fl:iv_ln:kononov-1,1,Ivan V. Kononov,fl:mi_ln:makushin-1,1,Mikhail P. Makushin,fl:dm_ln:polukhin-1,1,Dmitry I. Polukhin,fl:vy_ln:popov-2,1,Vyacheslav E. Popov,fl:vi_ln:salov-1,1,Viktor P. Salov,,,,,,,,,,,,,
4181004,1980,05/870135,1978,1,1,1,1,1,THE BURDICK GROUP,0,US,Milton,WI,Rock,G,3,3,2,1,fl:fr_ln:dominy-1,1,Francis I. Dominy,fl:le_ln:partridge-2,0,Leslie W. Partridge,fl:ve_ln:peltola-1,1,Veikko K. Peltola,,,,,,,,,,,,,,,,,,,0
4181005,1980,05/856804,1977,1,1,1,1,1,DORYOKURO KAKUNENRYO KAIHATSU JIGYODAN,0,JP,Tokyo,,,G,2,2,2,0,4i0on5d0j8offjgmtvdnvak1w,1,Naomichi Kanegae,tl04lg1pi0fiosf9r8f1c4j1a,1,Ichiro Ikemoto,,,,,,,,,,,,,,,,,,,,,,0
4181006,1980,05/938588,1978,1,1,1,1,1,PHILLIPS PETROLEUM COMPANY,0,US,Athens,OH,Athens,G,1,1,1,0,fl:do_ln:deford-1,1,Donald D. DeFord,,,,,,,,,,,,,,,,,,,,,,,,,0
4181007,1980,05/940341,1978,1,1,1,1,1,"DAICEL CHEMICAL INDUSTRIES, LTD.",0,JP,Sakai,,,G,3,2,2,0,fl:ka_ln:arisaka-3,,Katsuharu Arisaka,fl:se_ln:kobayashi-6,1,Seiichi Kobayashi,fl:ki_ln:higashio-2,1,Kiyoshi Higashio,,,,,,,,,,,,,,,,,,,0
4181008,1980,05/907215,1978,1,1,1,1,1,WESTINGHOUSE ELECTRIC CORP.,0,US,Pittsburgh,PA,Allegheny,G,1,1,1,0,fl:cl_ln:john-1,1,"Clarence D. John, Jr.",,,,,,,,,,,,,,,,,,,,,,,,,0
4181009,1980,05/899662,1978,1,1,1,1,1,CLARK EQUIPMENT COMPANY,0,US,Buchanan,MI,Berrien,G,1,1,1,0,fl:wi_ln:williamson-5,1,William A. Williamson,,,,,,,,,,,,,,,,,,,,,,,,,0
4181010,1980,05/920144,1978,1,1,1,1,1,GENERAL MOTORS CORPORATION,0,US,Detroit,MI,Wayne,G,2,2,2,0,fl:ri_ln:knape-1,1,Richard S. Knape,fl:ri_ln:moreau-1,1,Richard Moreau,,,,,,,,,,,,,,,,,,,,,,0
4181011,1980,05/904978,1978,1,1,1,1,1,MAATSCHAPPIJ VAN BERKEL'S PATENT N.V.,0,NL,Rotterdam,,,C,1,1,1,0,fl:al_ln:brendel-1,1,Albert E. Brendel,,,,,,,,,,,,,,,,,,,,,,,,,0
4181012,1980,05/937892,1978,1,1,1,1,1,KABUSHIKI KAISHA AKASHI SEISAKUSHO,0,JP,Tokyo,,,G,1,1,1,0,fl:mi_ln:kiuchi-7,1,Mitsuhiro Kiuchi,,,,,,,,,,,,,,,,,,,,,,,,,0