patent_number,grant_year,application_number,application_year,d_inventor,d_assignee,d_location,d_application,d_ipc,assignee,assignee_ind,country,city,state,county,ipc_section,team_size,inventors,men_inventors,women_inventors,inventor_id1,male_flag1,inventor_name1,inventor_id2,male_flag2,inventor_name2,inventor_id3,male_flag3,inventor_name3,inventor_id4,male_flag4,inventor_name4,inventor_id5,male_flag5,inventor_name5,inventor_id6,male_flag6,inventor_name6,inventor_id7,male_flag7,inventor_name7,inventor_id8,male_flag8,inventor_name8,inventor_id9,male_flag9,inventor_name9,assignee_sequence
4308622,1982,06/191668,1980,1,0,0,1,1,,0,,,,,A,1,1,1,0,uc89ht5kj5h1u0mkqor95gp5j,1,William F. Maddron,,,,,,,,,,,,,,,,,,,,,,,,,
4308623,1982,06/178864,1980,1,0,0,1,1,,0,,,,,A,1,1,0,1,fl:do_ln:voorhees-2,0,Donna S. Voorhees,,,,,,,,,,,,,,,,,,,,,,,,,
4308624,1982,06/064401,1979,1,1,1,1,1,"HEMEX, INC.",0,US,Austin,TX,Travis County,A,1,1,1,0,y25jsalgptihywk76wkh41iqr,1,Jerome J. Klawatter,,,,,,,,,,,,,,,,,,,,,,,,,0
4308625,1982,06/179303,1980,1,1,1,1,1,THE PROCTER & GAMBLE COMPANY,0,US,Cincinnati,OH,Hamilton,A E,1,1,1,0,fl:da_ln:kitko-2,1,David Johnathan Kitko,,,,,,,,,,,,,,,,,,,,,,,,,0
4308626,1982,06/230130,1981,1,1,1,1,1,CASPER SLEEP INC.,0,US,New York,NY,New York County,A,1,0,0,0,fl:si_ln:weiss-5,,Sidney M. Weiss,,,,,,,,,,,,,,,,,,,,,,,,,0
4308627,1982,06/176478,1980,1,0,0,1,1,,0,,,,,A,1,1,1,0,fl:me_ln:wallace-3,1,Melvin W. Wallace,,,,,,,,,,,,,,,,,,,,,,,,,
4308628,1982,06/069095,1979,1,0,0,1,1,,0,,,,,B,2,2,2,0,afijec3vx0x91aed7ra3i9yq8,1,Walter R. A. Kunberger,ut8czwieyonca3a5m4o34rwwk,1,Wyatt Ball,,,,,,,,,,,,,,,,,,,,,,
4308629,1982,06/013419,1979,1,0,0,1,1,,0,,,,,B,1,1,0,1,yr6tuaeivact1qrt5qko4c4c6,0,Margaret J. Freemon,,,,,,,,,,,,,,,,,,,,,,,,,
4308630,1982,06/142191,1980,1,0,0,1,1,,0,,,,,A,1,1,1,0,fl:ra_ln:schmidt-23,1,Rainer Schmidt,,,,,,,,,,,,,,,,,,,,,,,,,
4308631,1982,06/109498,1980,1,0,0,1,1,,0,,,,,B,1,1,1,0,fl:da_ln:hanna-3,1,Daniel C. Hanna,,,,,,,,,,,,,,,,,,,,,,,,,
4308632,1982,06/080532,1979,1,0,0,1,1,,0,,,,,E,2,2,2,0,fl:do_ln:dickson-4,1,Donald L. Dickson,fl:st_ln:dickson-1,1,Steven L. Dickson,,,,,,,,,,,,,,,,,,,,,,
4308633,1982,06/054258,1979,1,0,0,1,1,,0,,,,,B C,2,2,2,0,fl:ph_ln:vanhuffel-1,1,Phillip L. Van Huffel,fl:al_ln:bodner-2,1,Alex A. Bodner,,,,,,,,,,,,,,,,,,,,,,
4308634,1982,06/170090,1980,1,0,0,1,1,,0,,,,,A,1,1,1,0,fl:ab_ln:eisenberg-1,1,Abraham Eisenberg,,,,,,,,,,,,,,,,,,,,,,,,,
4308635,1982,06/134307,1980,1,1,1,1,1,ARMAN S.P.A.,0,IT,Druento,,,B,1,1,1,0,fl:gu_ln:maiocco-1,1,Guiseppe Maiocco,,,,,,,,,,,,,,,,,,,,,,,,,0
4308636,1982,06/945450,1978,1,0,0,1,1,,0,,,,,A,1,0,0,0,fl:jo_ln:davis-99,,John W. Davis,,,,,,,,,,,,,,,,,,,,,,,,,
4308637,1982,05/745618,1976,1,1,1,1,1,"ARTWAY MANUFACTURING CO., INC.",0,US,Chicago,IL,Cook County,E,1,1,1,0,fl:ro_ln:kucera-3,1,Robert D. Kucera,,,,,,,,,,,,,,,,,,,,,,,,,0
4308638,1982,06/130001,1980,1,0,0,1,1,,0,,,,,A,1,1,1,0,6rcd5xrn4i7zrsv12smhxpr1s,1,Akiel Senussi,,,,,,,,,,,,,,,,,,,,,,,,,
4308639,1982,06/155435,1980,1,1,1,1,1,STORK PMT B.V.,0,NL,,,,A,1,1,1,0,fl:ma_ln:vanmil-1,1,Martinus P. G. van Mil,,,,,,,,,,,,,,,,,,,,,,,,,0
4308640,1982,06/018648,1979,1,1,1,1,1,CELANESE CORPORATION,0,US,New York,NY,New York County,D,2,2,1,1,1l1zsdvqruvmtxgvg3q5tlepu,0,Jackie N. Bulla,6kd2ghsoke1x6uo4k9z00rn3r,1,Billy B. Fesperman,,,,,,,,,,,,,,,,,,,,,,0
4308641,1982,06/075372,1979,1,0,0,1,1,,0,,,,,B,1,1,1,0,fl:he_ln:niedecker-1,1,Herbert Niedecker,,,,,,,,,,,,,,,,,,,,,,,,,
4308642,1982,06/152194,1980,1,0,0,1,1,,0,,,,,A,1,1,1,0,fl:ar_ln:heyman-1,1,Arnold M. Heyman,,,,,,,,,,,,,,,,,,,,,,,,,
4308643,1982,06/180672,1980,1,0,0,1,1,,0,,,,,A F,1,1,1,0,fl:ja_ln:montplaisir-3,1,James J. Montplaisir,,,,,,,,,,,,,,,,,,,,,,,,,
4308644,1982,06/969304,1978,1,0,0,1,1,,0,,,,,A,1,1,1,0,fl:al_ln:brown-62,1,Alexander Brown,,,,,,,,,,,,,,,,,,,,,,,,,
4308645,1982,06/080705,1979,1,1,1,1,1,YOSHIDA KOGYO K.K.,0,JP,Tokyo,,,A,1,0,0,0,fl:ak_ln:hasegawa-7,,Akira Hasegawa,,,,,,,,,,,,,,,,,,,,,,,,,0
4308646,1982,06/035395,1979,1,1,1,1,1,"DZUS FASTENER CO., INC.",0,US,West Islip,NY,Suffolk,A,1,1,1,0,fl:pe_ln:schenk-2,1,Peter Schenk,,,,,,,,,,,,,,,,,,,,,,,,,0
4308647,1982,06/050965,1979,1,0,0,1,1,,0,,,,,A,1,1,1,0,fl:ro_ln:gillis-7,1,Robert E. Gillis,,,,,,,,,,,,,,,,,,,,,,,,,
4308648,1982,06/135003,1980,1,1,1,1,1,"MURRAY, INC.",0,US,Cockeysville,MD,Baltimore County,B F,1,1,1,0,fl:ro_ln:fay-3,1,Robert F. Fay,,,,,,,,,,,,,,,,,,,,,,,,,0
4308649,1982,06/149211,1980,1,1,1,1,1,MILLIKEN RESEARCH CORPORATION,0,US,Spartanburg,SC,Spartanburg,D,2,2,1,1,fl:mi_ln:gilpatrick-1,1,Michael W. Gilpatrick,fl:ca_ln:pack-4,0,Carroll L. Pack,,,,,,,,,,,,,,,,,,,,,,0
4308650,1982,06/107984,1979,1,1,1,1,1,GTE PRODUCTS CORPORATION,0,US,Stamford,CT,Fairfield,H,3,2,2,0,fl:ra_ln:hernandez-7,1,Rafael J. Hernandez,fl:th_ln:yong-1,1,Thomas S. Yong,fl:ta_ln:sadoski-1,,Tadius T. Sadoski,,,,,,,,,,,,,,,,,,,0
4308651,1982,06/081328,1979,1,1,1,1,1,EDUARD KUSTERS MASCHINENFABRIK GMBH & CO. KG,0,DE,Krefeld,,,B,2,2,2,0,fl:va_ln:appenzeller-1,1,Valentin Appenzeller,fl:ka_ln:ahrweiler-1,1,Karl-Heinz Ahrweiler,,,,,,,,,,,,,,,,,,,,,,0
4308652,1982,06/123397,1980,1,1,1,1,1,KARMAZIN PRODUCTS CORPORATION,0,US,Wyandotte,MI,Wayne,B,1,1,1,0,fl:iv_ln:woodhull-1,1,"Ivan D. Woodhull, Jr.",,,,,,,,,,,,,,,,,,,,,,,,,0
4308653,1982,06/082920,1979,1,1,1,1,1,SCHLEGEL (UK) LIMITED,0,GB,Garforth,,,B,2,2,2,0,fl:ke_ln:hinton-1,1,Kevin R. Hinton,fl:ba_ln:guymer-1,1,Barry R. Guymer,,,,,,,,,,,,,,,,,,,,,,0
4308654,1982,06/078526,1979,1,1,1,1,1,MONSANTO COMPANY,0,US,Chesterfield,MO,St. Louis,B,1,1,1,0,fl:ma_ln:bogart-2,1,Marlowe C. Bogart,,,,,,,,,,,,,,,,,,,,,,,,,0
4308655,1982,06/084655,1979,1,1,1,1,1,CREUSOT-LOIRE,0,FR,Paris,,,B,1,1,1,0,fl:pi_ln:berger-1,1,Pierre Berger,,,,,,,,,,,,,,,,,,,,,,,,,0
4308656,1982,06/048269,1979,1,1,1,1,1,REVERE COPPER AND BRASS INCORPORATED,0,US,New York,NY,New York County,B,1,1,1,0,fl:ri_ln:jenks-2,1,Richard H. Jenks,,,,,,,,,,,,,,,,,,,,,,,,,0
4308657,1982,06/074189,1979,1,1,1,1,1,GTE PRODUCTS CORPORATION,0,US,Stamford,CT,Fairfield,H,1,1,1,0,fl:jo_ln:anderton-2,1,John J. Anderton,,,,,,,,,,,,,,,,,,,,,,,,,0
4308658,1982,06/116244,1980,1,1,1,1,1,SHARP KABUSHIKI KAISHA,0,JP,Osaka,,,G H,4,3,3,0,fl:ko_ln:yano-4,1,Kohzo Yano,fl:sa_ln:takechi-1,,Sadatoshi Takechi,fl:ya_ln:inami-2,1,Yasuhiko Inami,fl:hi_ln:uede-2,1,Hisashi Uede,,,,,,,,,,,,,,,,0
4308659,1982,06/152020,1980,1,1,1,1,1,AMP INCORPORATED,0,US,Harrisburg,PA,Dauphin,H,3,3,3,0,fl:jo_ln:brandewie-1,1,Joseph E. Brandewie,fl:st_ln:feldman-12,1,Steven Feldman,fl:ma_ln:jackson-34,1,Mark F. Jackson,,,,,,,,,,,,,,,,,,,0
4308660,1982,06/143696,1980,1,1,1,1,1,AMP INCORPORATED,0,US,Harrisburg,PA,Dauphin,B H,3,3,2,1,fl:ch_ln:brown-19,1,Christopher K. Brown,fl:ke_ln:johnson-124,0,Keith A. Johnson,fl:do_ln:wion-1,1,Donald A. Wion,,,,,,,,,,,,,,,,,,,0
4308661,1982,06/138244,1980,1,0,0,1,1,,0,,,,,B H,1,1,1,0,fl:ol_ln:hallstrom-2,1,Olof A. Hallstrom,,,,,,,,,,,,,,,,,,,,,,,,,
4308662,1982,06/052165,1979,1,1,1,1,1,"WESTERN ELECTRIC COMPANY, INC.",0,US,New York,NY,New York County,B H,1,1,1,0,fl:wi_ln:bohannon-2,1,"William D. Bohannon, Jr.",,,,,,,,,,,,,,,,,,,,,,,,,0
4308663,1982,06/108746,1979,1,1,1,1,1,WARNER-LAMBERT COMPANY,0,US,Morristown,NJ,Morris,B,1,1,1,0,fl:jo_ln:ciaffone-1,1,John T. Ciaffone,,,,,,,,,,,,,,,,,,,,,,,,,0
4308664,1982,06/134312,1980,1,0,0,1,1,,0,,,,,B,1,1,1,0,fl:he_ln:morris-6,1,Henry Morris,,,,,,,,,,,,,,,,,,,,,,,,,
4308665,1982,06/122676,1980,1,0,0,1,1,,0,,,,,G,1,1,1,0,vj2mi8f5eabd8ax2kl7dekxlp,1,Eugene R. Losch,,,,,,,,,,,,,,,,,,,,,,,,,
4308666,1982,06/057977,1979,1,1,1,1,1,ERNST LEITZ WETZLAR GMBH,0,DE,Wetzlar,,,G,4,4,4,0,fl:he_ln:hahn-11,1,Herbert Hahn,fl:ha_ln:jacoby-4,1,Hans-Dieter Jacoby,fl:ri_ln:jung-3,1,Richard H. Jung,fl:er_ln:schuster-2,1,Erich Schuster,,,,,,,,,,,,,,,,0
4308667,1982,06/126854,1980,1,1,1,1,1,BABCOCK-BSH GMBH,0,DE,Krefeld,,,F,3,3,3,0,fl:fr_ln:roos-2,1,Friedrich Roos,fl:jo_ln:bolz-2,1,Johannes Bolz,fl:in_ln:grebe-1,1,Ingo Grebe,,,,,,,,,,,,,,,,,,,0
4308668,1982,06/154760,1980,1,1,1,1,1,MITSUBISHI JUKOGYO KABUSHIKI KAISHA,0,JP,Tokyo,,,F,6,3,2,1,fl:yo_ln:ito-32,1,Yoshifumi Ito,fl:yo_ln:nishimoto-2,1,Yoshihiko Nishimoto,fl:ki_ln:taoda-1,,Kiyomichi Taoda,fl:fu_ln:sato-16,0,Fumiaki Sato,fl:ta_ln:ueda-38,,Takashi Ueda,fl:se_ln:uehara-3,,Seibi Uehara,,,,,,,,,,0
4308669,1982,06/151288,1980,1,1,1,1,1,"BEARD INDUSTRIES, INC.",0,US,Frankfort,IN,Clinton,F,2,2,2,0,fl:ro_ln:noyes-1,1,Ronald T. Noyes,fl:eu_ln:williams-3,1,Eugene E. Williams,,,,,,,,,,,,,,,,,,,,,,0
4308670,1982,06/187611,1980,1,1,1,1,1,THE GILLETTE COMPANY,0,US,Boston,MA,Suffolk,A,1,1,1,0,fl:ja_ln:bonnema-1,1,James Bonnema,,,,,,,,,,,,,,,,,,,,,,,,,0
4308671,1982,06/152679,1980,1,0,0,1,1,,0,,,,,A,1,1,1,0,fl:wa_ln:bretschneider-1,1,Walter Bretschneider,,,,,,,,,,,,,,,,,,,,,,,,,
4308672,1982,06/021009,1979,1,0,0,1,1,,0,,,,,A,1,1,1,0,fl:an_ln:antonious-1,1,Anthony J. Antonious,,,,,,,,,,,,,,,,,,,,,,,,,
4308673,1982,06/052306,1979,1,1,1,1,1,DEUTSCHE GOLD- UND SILBER-SCHEIDEANSTALT VORMALS ROESSLER,0,DE,Frankfurt,,,A,1,1,1,0,fl:ol_ln:mobius-1,1,Olaf Mobius,,,,,,,,,,,,,,,,,,,,,,,,,0
4308674,1982,06/100817,1979,1,1,1,1,1,CALZATURIFICIO F.LLI DANIELI S.P.A.,0,IT,Cortina d'Ampezzo,,,A,1,1,1,0,fl:va_ln:tessaro-1,1,Vanio TESSARO,,,,,,,,,,,,,,,,,,,,,,,,,0
4308675,1982,06/127824,1980,1,1,1,1,1,OUTBOARD MARINE CORPORATION,0,US,Waukegan,IL,Lake,E,2,2,2,0,fl:wa_ln:pendry-1,1,Warren W. Pendry,fl:ca_ln:seyerle-1,1,Carl E. Seyerle,,,,,,,,,,,,,,,,,,,,,,0
4308676,1982,06/169500,1980,1,0,0,1,1,,0,,,,,E,1,1,1,0,fl:ma_ln:doane-1,1,Maurice S. Doane,,,,,,,,,,,,,,,,,,,,,,,,,
4308677,1982,06/148181,1980,1,1,1,1,1,REYNOLDS MANUFACTURING COMPANY,0,US,Cedartown,GA,Polk,E,1,1,1,0,fl:wi_ln:behm-3,1,William C. Behm,,,,,,,,,,,,,,,,,,,,,,,,,0
4308678,1982,06/214575,1980,1,0,0,1,1,,0,,,,,G,1,1,1,0,fdwnu13h9m5a2vnr86103n8aa,1,Joel B. Slobin,,,,,,,,,,,,,,,,,,,,,,,,,
4308679,1982,06/219008,1980,1,1,1,1,1,GENERAL FOODS CORPORATION,0,US,White Plains,NY,Westchester,G,3,2,2,0,fl:ge_ln:ray-1,1,"George C. Ray, III",fl:mi_ln:otto-5,1,Michael Otto,fl:ch_ln:price-31,,Charles E. Price,,,,,,,,,,,,,,,,,,,0
4308680,1982,06/146067,1980,1,0,0,1,1,,0,,,,,G,1,1,1,0,1kb6bhdfp8091oxybvpoo6olx,1,Aharon Aboudi,,,,,,,,,,,,,,,,,,,,,,,,,
4308681,1982,06/130383,1980,1,0,0,1,1,,0,,,,,F,1,1,1,0,fl:ri_ln:gorman-3,1,Richard Gorman,,,,,,,,,,,,,,,,,,,,,,,,,
4308682,1982,06/172963,1980,1,0,0,1,1,,0,,,,,A,1,1,1,0,d2x4hfx9abm5803rdcyixtj9l,1,Edward Cesar,,,,,,,,,,,,,,,,,,,,,,,,,
4308683,1982,06/157005,1980,1,0,0,1,1,,0,,,,,A,1,0,0,0,fl:do_ln:lee-232,,Donald R. Lee,,,,,,,,,,,,,,,,,,,,,,,,,
4308684,1982,06/208695,1980,1,1,1,1,1,MARVIN GLASS & ASSOCIATES,0,US,Chicago,IL,Cook County,A,3,3,3,0,fl:mi_ln:ferris-5,1,Michael J. Ferris,fl:ha_ln:disko-1,1,Harry Disko,fl:sa_ln:cottone-1,1,Sam Cottone,,,,,,,,,,,,,,,,,,,0
4308685,1982,06/131867,1980,1,0,0,1,1,,0,,,,,A,1,1,1,0,fl:re_ln:hertel-1,1,Reinhard Hertel,,,,,,,,,,,,,,,,,,,,,,,,,
4308686,1982,06/151435,1980,1,1,1,1,1,"TOMY KOGYO CO., INC.",0,JP,Tokyo,,,A,1,1,0,1,fl:ma_ln:ikeda-44,0,Masaki Ikeda,,,,,,,,,,,,,,,,,,,,,,,,,0
4308687,1982,06/162992,1980,1,1,1,1,1,CENTRO RICERCHE FIAT S.P.A.,0,IT,Torino,,,A,2,2,2,0,2kzfz3ywhodd423xzqmrh7l0q,1,Giancarlo Cavanna,fl:gi_ln:tavoni-1,1,Gian Paolo Tavoni,,,,,,,,,,,,,,,,,,,,,,0
4308688,1982,06/126459,1980,1,0,0,1,1,,0,,,,,A,1,0,0,0,fl:th_ln:revane-2,,Thomas L. Revane,,,,,,,,,,,,,,,,,,,,,,,,,
4308689,1982,06/109879,1980,1,0,0,1,1,,0,,,,,A,2,2,2,0,4a9tc12qw9rotwhls91ez4dvd,1,Clark E. Jenson,fl:wa_ln:wolfe-1,1,Warren D. Wolfe,,,,,,,,,,,,,,,,,,,,,,
4308690,1982,06/146643,1980,1,1,1,1,1,"KLEIN PLASTIC PRODUCTS, INC.",0,US,Baraboo,WI,Sauk,A,1,1,1,0,fl:ma_ln:klein-45,1,Max S. Klein,,,,,,,,,,,,,,,,,,,,,,,,,0
4308691,1982,06/145000,1980,1,1,1,1,1,GEBR. BODE GMBH & CO. KG,0,DE,Kassel,,,E,1,1,0,1,fl:ma_ln:horn-12,0,Manfred Horn,,,,,,,,,,,,,,,,,,,,,,,,,0
4308692,1982,06/050594,1979,1,0,0,1,1,,0,,,,,E,2,2,1,1,fl:ro_ln:rumble-2,1,"Roy W. Rumble, deceased",d0q5sonuc42e27wtf3d7enplq,0,"by Zilla K. Rumble, executrix",,,,,,,,,,,,,,,,,,,,,,
4308693,1982,06/013630,1979,1,1,1,1,1,HARPER BUFFING MACHINE CO.,0,US,Town of East Hartford,CT,Hartford,B,1,1,1,0,fl:jo_ln:harper-21,1,John Harper,,,,,,,,,,,,,,,,,,,,,,,,,0
4308694,1982,06/168456,1980,1,1,1,1,1,"LITTON INDUSTRIAL PRODUCTS, INC.",0,US,Waynesboro,PA,Franklin,B,1,1,1,0,fl:ro_ln:bricker-2,1,Robert E. Bricker,,,,,,,,,,,,,,,,,,,,,,,,,0
4308695,1982,06/077773,1979,1,1,1,1,1,ELTREVA AG,0,CH,Aesch,,,E,1,1,1,0,dr9118t5yv0h3tlw5ka37g9dv,1,Ruedi Ehrsam,,,,,,,,,,,,,,,,,,,,,,,,,0
4308696,1982,06/129419,1980,1,1,1,1,1,"ROMAR TECHNOLOGIES, INC.",0,US,Bensenville,IL,DuPage,E,1,1,1,0,fl:ro_ln:schroeder-19,1,Robert Schroeder,,,,,,,,,,,,,,,,,,,,,,,,,0
4308697,1982,06/118228,1980,1,1,1,1,1,LOEWY ROBERTSON ENGINEERING CO. LTD.,0,GB,Woodside,,,B,1,1,1,0,fl:da_ln:guppy-2,1,David W. Guppy,,,,,,,,,,,,,,,,,,,,,,,,,0
4308698,1982,06/128504,1980,1,0,0,1,1,,0,,,,,E,1,1,1,0,fl:gr_ln:fleishman-1,1,Gregg R. Fleishman,,,,,,,,,,,,,,,,,,,,,,,,,
4308699,1982,06/099263,1977,1,1,1,1,1,GENERAL DYNAMICS CORPORATION,0,US,San Diego,CA,San Diego,E,1,1,1,0,fl:pa_ln:slysh-1,1,Paul Slysh,,,,,,,,,,,,,,,,,,,,,,,,,0
4308700,1982,06/083335,1979,1,0,0,1,1,,0,,,,,E,1,1,1,0,fl:by_ln:romig-1,1,"Byron A. Romig, Jr.",,,,,,,,,,,,,,,,,,,,,,,,,
4308701,1982,06/148456,1980,1,0,0,1,1,,0,,,,,E,1,1,1,0,xdkmvtgqgdbs67qck2ky0rk1r,1,Victor E. Wojick,,,,,,,,,,,,,,,,,,,,,,,,,
4308702,1982,06/174044,1980,1,1,1,1,1,GAF CORPORATION,0,US,New York,NY,New York County,B E,1,1,1,0,fl:jo_ln:rajewski-1,1,Joseph Rajewski,,,,,,,,,,,,,,,,,,,,,,,,,0
4308703,1982,06/113171,1980,1,0,0,1,1,,0,,,,,E,1,1,1,0,fl:ja_ln:knowles-5,1,James Knowles,,,,,,,,,,,,,,,,,,,,,,,,,
4308704,1982,06/101438,1979,1,0,0,1,1,,0,,,,,B E,1,1,1,0,fl:ra_ln:lloyd-2,1,Ralph E. Lloyd,,,,,,,,,,,,,,,,,,,,,,,,,
4308705,1982,06/018889,1979,1,0,0,1,1,,0,,,,,D E,1,1,1,0,fl:wa_ln:hufnagl-1,1,Walter Hufnagl,,,,,,,,,,,,,,,,,,,,,,,,,
4308706,1982,06/201607,1980,1,1,1,1,1,HUNTER DOUGLAS INTERNATIONAL N.V.,0,NL,Willemstad,,,E,1,1,1,0,fl:wi_ln:rijnders-1,1,Willem Rijnders,,,,,,,,,,,,,,,,,,,,,,,,,0
4308707,1982,06/099763,1979,1,1,1,1,1,"OWENS-ILLINOIS, INC.",0,US,Toledo,OH,Lucas,B,1,1,1,0,fl:we_ln:willingham-1,1,Wendell D. Willingham,,,,,,,,,,,,,,,,,,,,,,,,,0
4308708,1982,06/065408,1979,1,1,1,1,1,FOCKE & PFUHL,0,DE,Verden,,,B,1,1,1,0,fl:he_ln:focke-1,1,Heinz Focke,,,,,,,,,,,,,,,,,,,,,,,,,0
4308709,1982,06/116899,1980,1,0,0,1,1,,0,,,,,B,2,2,2,0,fl:do_ln:williams-10,1,Donald F. Williams,fl:ch_ln:phy-1,1,Charles Lee Phy,,,,,,,,,,,,,,,,,,,,,,
4308710,1982,06/045960,1979,1,1,1,1,1,E. I. DU PONT DE NEMOURS AND COMPANY,0,US,Wilmington,DE,New Castle,B,1,1,1,0,fl:ha_ln:sandberg-1,1,Harry W. Sandberg,,,,,,,,,,,,,,,,,,,,,,,,,0
4308711,1982,06/083370,1979,1,1,1,1,1,MAHAFFY & HARDER ENGINEERING CO.,0,US,Totowa,NJ,Passaic,B,2,2,2,0,fl:re_ln:mahaffy-1,1,Reid A. Mahaffy,fl:wa_ln:mainberger-1,1,Walter A. Mainberger,,,,,,,,,,,,,,,,,,,,,,0
4308712,1982,06/118271,1980,1,0,0,1,1,,0,,,,,B,1,1,1,0,fl:ha_ln:hagedorn-3,1,Hans Hagedorn,,,,,,,,,,,,,,,,,,,,,,,,,
4308713,1982,06/144312,1980,1,1,1,1,1,TERRAIN KING CORPORATION,0,US,Seguin,TX,Guadalupe,A,1,1,1,0,fl:ro_ln:james-5,1,Ronald N. James,,,,,,,,,,,,,,,,,,,,,,,,,0
4308714,1982,06/052756,1979,1,1,1,1,1,"ALLOWAY MANUFACTURING, INC.",0,US,Fargo,ND,Cass,A,1,1,1,0,fl:do_ln:gates-2,1,Donald C. Gates,,,,,,,,,,,,,,,,,,,,,,,,,0
4308715,1982,06/196482,1980,1,1,1,1,1,MASCHINENFABRIK RIETER AG,0,CH,Winterthur,,,C D,1,1,1,0,8kw76i0vvecnr9i1486chrwhs,1,Gustav Staehli,,,,,,,,,,,,,,,,,,,,,,,,,0
4308716,1982,06/167059,1980,1,1,1,1,1,BARMAG AG,0,DE,Remscheid,,,D,1,1,1,0,fl:ka_ln:bauer-8,1,Karl-Heinz Bauer,,,,,,,,,,,,,,,,,,,,,,,,,0
4308717,1982,06/121015,1980,1,1,1,1,1,KABUSHIKI KAISHA TOYODA JIDOSHOKKI SEISAKUSHO,0,MH,Ebeye,,,D,4,4,4,0,fl:ke_ln:onoue-4,1,Keiji Onoue,fl:ta_ln:katoh-21,1,Takashi Katoh,fl:yo_ln:yoshida-23,1,Yoshiaki Yoshida,fl:ka_ln:seiki-2,1,Kazuo Seiki,,,,,,,,,,,,,,,,0
4308718,1982,05/973609,1978,1,0,0,1,1,,0,,,,,A,1,1,1,0,fl:ja_ln:mowill-1,1,Jan Mowill,,,,,,,,,,,,,,,,,,,,,,,,,
4308719,1982,06/065136,1979,1,0,0,1,1,,0,,,,,D,1,1,1,0,fl:da_ln:abrahamson-2,1,Daniel P. Abrahamson,,,,,,,,,,,,,,,,,,,,,,,,,
4308720,1982,06/093371,1979,1,1,1,1,1,PNEUMO CORPORATION,0,US,Boston,MA,Suffolk,F,1,1,1,0,fl:ja_ln:brandstadter-1,1,Jack M. Brandstadter,,,,,,,,,,,,,,,,,,,,,,,,,0
4308721,1982,06/071961,1979,1,1,1,1,1,SPERRY CORPORATION,0,GB,Bracknell,,,F,2,2,2,0,fl:al_ln:thomas-26,1,Alan V. Thomas,fl:ge_ln:bone-2,1,Geoffrey E. Bone,,,,,,,,,,,,,,,,,,,,,,0
4308722,1982,06/046668,1979,1,0,0,1,1,,0,,,,,F,2,2,2,0,fl:al_ln:molini-1,1,Alberto E. Molini,fl:cl_ln:zener-1,1,Clarence Zener,,,,,,,,,,,,,,,,,,,,,,
4308723,1982,06/050548,1979,1,1,1,1,1,ATLANTIC RICHFIELD COMPANY,0,US,Los Angeles,CA,Los Angeles,F,1,1,1,0,fl:am_ln:ecker-1,1,Amir L. Ecker,,,,,,,,,,,,,,,,,,,,,,,,,0
4308724,1982,06/147369,1980,1,0,0,1,1,,0,,,,,F G,1,1,1,0,z3q5mlhqj6mcrd7zb4y8zq84d,1,Nicholas M. La Ginestra,,,,,,,,,,,,,,,,,,,,,,,,,
4308725,1982,06/022377,1979,1,1,1,1,1,"DIESEL KIKI CO., LTD.",0,JP,Tokyo,,,G H,1,1,1,0,fl:ts_ln:chiyoda-2,1,Tsuneyuki Chiyoda,,,,,,,,,,,,,,,,,,,,,,,,,0
4308726,1982,06/025350,1979,1,1,1,1,1,TYLER REFRIGERATION CORPORATION,0,US,Niles,MI,Berrien County,A,2,1,1,0,fl:ar_ln:perez-11,,Arthur Perez,fl:fa_ln:abraham-1,1,Fayez F. Abraham,,,,,,,,,,,,,,,,,,,,,,0
4308727,1982,06/065554,1979,1,0,0,1,1,,0,,,,,A,1,1,1,0,fl:ma_ln:elbe-2,1,Maximo Elbe,,,,,,,,,,,,,,,,,,,,,,,,,
4308728,1982,06/066393,1979,1,1,1,1,1,UNIVERSITY OF LEEDS INDUSTRIAL SERVICES LIMITED,0,GB,,,,F,1,1,1,0,p3djt3p1m0qr5g6k32vywauk6,1,Louis P. Croset,,,,,,,,,,,,,,,,,,,,,,,,,0
4308729,1982,06/136704,1980,1,1,1,1,1,"TWIN DISC, INCORPORATED",0,US,Racine,WI,Racine County,F,1,1,1,0,fl:wi_ln:condon-1,1,William T. Condon,,,,,,,,,,,,,,,,,,,,,,,,,0
4308730,1982,06/130716,1980,1,0,0,1,1,,0,,,,,E,1,1,0,1,fl:do_ln:roth-16,0,Donald P. Roth,,,,,,,,,,,,,,,,,,,,,,,,,
4308731,1982,06/033540,1979,1,1,1,1,1,"PRESTO LOCK COMPANY, DIVISION OF WALTER KIDDE & COMPANY, INC.",0,US,Garfield,NJ,Bergen,E,1,1,1,0,fl:ri_ln:remington-3,1,Richard C. Remington,,,,,,,,,,,,,,,,,,,,,,,,,0
4308732,1982,06/090031,1979,1,0,0,1,1,,0,,,,,E,1,1,0,1,fl:lu_ln:hau-2,0,Luo C. Hau,,,,,,,,,,,,,,,,,,,,,,,,,
4308733,1982,05/961121,1978,1,0,0,1,1,,0,,,,,B E F,1,1,1,0,fl:ge_ln:tampa-2,1,George R. Tampa,,,,,,,,,,,,,,,,,,,,,,,,,
4308734,1982,06/141705,1980,1,1,1,1,1,FEDERAL-MOGUL CORPORATION,0,US,Southfield,MI,Oakland,B,1,1,1,0,fl:ch_ln:senft-3,1,Charles R. Senft,,,,,,,,,,,,,,,,,,,,,,,,,0
4308735,1982,06/126963,1980,1,1,1,1,1,KABUSHIKI KAISHA KOMATSU SEISAKUSHO,0,JP,Tokyo,,,B,1,1,1,0,fl:ik_ln:nishi-1,1,Ikuo Nishi,,,,,,,,,,,,,,,,,,,,,,,,,0
4308736,1982,06/136980,1980,1,1,1,1,1,"J & S HYDRAULICS, INC.",0,US,Milford,CT,New Haven County,B,2,2,2,0,fl:je_ln:lowe-1,1,Jerome R. Lowe,fl:fr_ln:russo-6,1,Frank Russo,,,,,,,,,,,,,,,,,,,,,,0
4308737,1982,06/090614,1979,1,1,1,1,1,L. SCHULER GMBH,0,DE,Göppingen,,,B,3,3,3,0,fl:re_ln:kannegiesser-1,1,Reinhard Kannegiesser,fl:ra_ln:guthle-1,1,Rainer Guthle,fl:ku_ln:finsterwalder-1,1,Kurt Finsterwalder,,,,,,,,,,,,,,,,,,,0
4308738,1982,06/085318,1979,1,1,1,1,1,NIDEC COPAL CORPORATION,0,JP,Tokyo,,,B,1,1,1,0,fl:ri_ln:yoshida-5,1,Riichiro Yoshida,,,,,,,,,,,,,,,,,,,,,,,,,0
4308739,1982,06/115611,1980,1,1,1,1,1,TIPPINS INCORPORATED,0,US,Pittsburgh,PA,Allegheny,B,1,1,1,0,fl:ge_ln:tippins-1,1,George W. Tippins,,,,,,,,,,,,,,,,,,,,,,,,,0
4308740,1982,06/110249,1980,1,1,1,1,1,KOCKS TECHNIK GMBH & CO.,0,DE,Düsseldorf,,,B,1,1,1,0,fl:ha_ln:brauer-3,1,Hans Brauer,,,,,,,,,,,,,,,,,,,,,,,,,0
4308741,1982,06/109795,1980,1,1,1,1,1,"ISHIKAWAJIMA-HARIMA HEAVY INDUSTRIES CO., LTD.",0,JP,Tokyo,,,B,2,1,1,0,fl:hi_ln:ishii-38,1,Hikonori Ishii,fl:ke_ln:ide-9,,Kenichi Ide,,,,,,,,,,,,,,,,,,,,,,0
4308742,1982,05/755747,1976,1,0,0,1,1,,0,,,,,B,2,2,2,0,fl:ne_ln:harrison-3,1,Nelson K. Harrison,fl:da_ln:lamb-1,1,Dana B. Lamb,,,,,,,,,,,,,,,,,,,,,,
4308743,1982,06/081036,1979,1,0,0,1,1,,0,,,,,B,1,1,1,0,fl:jo_ln:pizzuto-1,1,Joseph Pizzuto,,,,,,,,,,,,,,,,,,,,,,,,,
4308744,1982,06/119850,1980,1,1,1,1,1,"UNITED SUPPLY, INC.",0,US,Providence,RI,Providence County,B,1,1,1,0,fl:el_ln:baker-3,1,Ellery L. Baker,,,,,,,,,,,,,,,,,,,,,,,,,0
4308745,1982,06/149425,1980,1,0,0,1,1,,0,,,,,B,8,8,7,1,5jlw2eli5qz8xn79zb59luxum,1,Evgeny I. Lisitsa,n5wwlcx1j573xomwo1q1xf6w1,1,Alexandr M. Gursky,e7omdnfanhiclo7v8vlho9dpm,1,Vitaly G. Kuimov,vlplfluopjh4bmigeex0vzh0j,0,Jury S. Makazan,aqyblka8jthcxdjl6362bqvq0,1,Alexandr V. Paulsky,etbl5hriliog95ztwi3xbrwuf,1,Fedor A. Reznichenko,fl:al_ln:romanov-11,1,Alexandr V. Romanov,ufm6va7lnzd1dtw3xbx5j2h89,1,Efim L. Uzorovsky,,,,
4308746,1982,06/104371,1979,1,1,1,1,1,CRUTCHER RESOURCES CORPORATION,0,US,Houston,TX,Harris County,G,1,1,1,0,fl:mo_ln:covington-1,1,Morris T. Covington,,,,,,,,,,,,,,,,,,,,,,,,,0
4308747,1982,06/134644,1980,1,1,1,1,1,THE B. F. GOODRICH COMPANY,0,US,New York,NY,New York County,G,1,1,1,0,fl:eu_ln:reed-2,1,Eugene L. Reed,,,,,,,,,,,,,,,,,,,,,,,,,0
4308748,1982,06/099157,1979,1,1,1,1,1,THE ARO CORPORATION,0,US,Tullahoma,TN,Coffee County,G,1,1,1,0,fl:ja_ln:jacocks-1,1,James L. Jacocks,,,,,,,,,,,,,,,,,,,,,,,,,0
4308749,1982,06/151588,1980,1,1,1,1,1,THOMSON-CSF,0,FR,Paris,,,G,2,2,2,0,fl:no_ln:clavelloux-1,1,Noel Clavelloux,fl:fr_ln:peynaud-1,1,Francois Peynaud,,,,,,,,,,,,,,,,,,,,,,0
4308750,1982,06/154638,1980,1,1,1,1,1,THE UNITED STATES OF AMERICA AS REPRESENTED BY THE SECRETARY OF THE AIR FORCE,0,US,Washington,DC,District of Columbia,G,1,1,1,0,fl:da_ln:steinman-1,1,David A. Steinman,,,,,,,,,,,,,,,,,,,,,,,,,0
4308751,1982,06/029005,1979,1,0,0,1,1,,0,,,,,G,3,3,3,0,fl:he_ln:thurner-2,1,Heinz Thurner,fl:ak_ln:sandstrom-1,1,Ake Sandstrom,fl:ch_ln:svensson-4,1,Christer Svensson,,,,,,,,,,,,,,,,,,,
4308752,1982,06/123016,1980,1,1,1,1,1,FISCHER & PORTER COMPANY,0,US,Warminster,PA,Bucks,G,2,2,2,0,fl:eg_ln:appel-1,1,Eggert Appel,fl:pe_ln:nissen-3,1,Peter Nissen,,,,,,,,,,,,,,,,,,,,,,0
4308753,1982,06/099380,1979,1,1,1,1,1,THE UNITED STATES OF AMERICA AS REPRESENTED BY THE SECRETARY OF THE NAVY,0,US,Washington,DC,District of Columbia,G,1,1,1,0,fl:ja_ln:olson-7,1,Jack R. Olson,,,,,,,,,,,,,,,,,,,,,,,,,0
4308754,1982,06/086402,1979,1,1,1,1,1,"PANAMETRICS, INC.",0,US,Waltham,MA,Middlesex,G,4,3,3,0,fl:no_ln:pedersen-2,1,Norman E. Pedersen,fl:ja_ln:bradshaw-3,1,James E. Bradshaw,fl:ja_ln:matson-3,,James E. Matson,fl:la_ln:lynnworth-1,1,Lawrence C. Lynnworth,,,,,,,,,,,,,,,,0
4308755,1982,06/051981,1979,1,0,0,1,1,,0,,,,,G,3,3,3,0,fl:ro_ln:millar-6,1,Robert Millar,fl:ch_ln:stapleton-3,1,Charles Stapleton,fl:jo_ln:hauf-2,1,John M. Hauf,,,,,,,,,,,,,,,,,,,
4308756,1982,06/162580,1980,1,1,1,1,1,UHV INSTRUMENTS LTD.,0,CA,Burlington,ON,,G,3,2,2,0,fl:ja_ln:robinson-30,,James E. Robinson,fl:an_ln:pant-6,1,Aniket Pant,fl:ro_ln:legg-2,1,Roger C. Legg,,,,,,,,,,,,,,,,,,,0
4308757,1982,06/133175,1980,1,1,1,1,1,AUTOVOX S.P.A.,0,IT,Roma,,,H,1,1,1,0,fl:ez_ln:dellantonio-1,1,Ezio F. Dellantonio,,,,,,,,,,,,,,,,,,,,,,,,,0
4308758,1982,06/133307,1980,1,0,0,1,1,,0,,,,,F,1,1,1,0,fl:c._ln:humphrey-2,1,C. Thomas Humphrey,,,,,,,,,,,,,,,,,,,,,,,,,
4308759,1982,06/829156,1977,1,1,1,1,1,ROLLEI-WERKE FRANKE & HEIDECKE,0,DE,Braunschweig,,,F,1,1,1,0,fl:re_ln:sobotta-1,1,Reinhard Sobotta,,,,,,,,,,,,,,,,,,,,,,,,,0
4308760,1982,06/131050,1980,1,1,1,1,1,THYSSEN INDUSTRIE AG,0,DE,,,,F,2,2,2,0,qxd6ffkaikpwnoyvqllpuutc0,1,Otto Voigtlander,fl:wa_ln:mages-1,1,Walter J. Mages,,,,,,,,,,,,,,,,,,,,,,0
4308761,1982,06/143359,1980,1,1,1,1,1,SHIMANO INC.,0,JP,Osaka,,,B G,1,1,1,0,fl:ke_ln:shimano-3,1,Keizo Shimano,,,,,,,,,,,,,,,,,,,,,,,,,0
4308762,1982,06/140099,1980,1,1,1,1,1,"OAKLEY, INC.",0,US,Laguna Hills,CA,Orange,B,1,1,1,0,fl:ja_ln:jannard-2,1,James H. Jannard,,,,,,,,,,,,,,,,,,,,,,,,,0
4308763,1982,05/939316,1978,1,1,1,1,1,REGIE NATIONALE DES USINES RENAULT,0,FR,Boulogne-Billancourt,,,F,1,1,1,0,fl:ro_ln:brisabois-1,1,Roger Brisabois,,,,,,,,,,,,,,,,,,,,,,,,,0
4308764,1982,06/087653,1979,1,1,1,1,1,AISIN-WARNER K.K.,0,PE,Calacoa Bellavista,,,B F,2,2,2,0,fl:mu_ln:kawamoto-3,1,Mutsumi Kawamoto,fl:no_ln:miki-12,1,Nobuaki Miki,,,,,,,,,,,,,,,,,,,,,,0