patent_number,grant_year,application_number,application_year,d_inventor,d_assignee,d_location,d_application,d_ipc,assignee,assignee_ind,country,city,state,county,ipc_section,team_size,inventors,men_inventors,women_inventors,inventor_id1,male_flag1,inventor_name1,inventor_id2,male_flag2,inventor_name2,inventor_id3,male_flag3,inventor_name3,inventor_id4,male_flag4,inventor_name4,inventor_id5,male_flag5,inventor_name5,inventor_id6,male_flag6,inventor_name6,inventor_id7,male_flag7,inventor_name7,inventor_id8,male_flag8,inventor_name8,inventor_id9,male_flag9,inventor_name9,assignee_sequence
4633526,1987,06/785671,1985,1,1,1,1,1,THE SECRETARY OF STATE FOR DEFENCE IN HER BRITANNIC MAJESTY'S GOVERNMENT OF THE UNITED KINGDOM OF GREAT BRITAIN AND NORTHERN IRELAND,0,GB,London,,,A,1,1,1,0,fl:gr_ln:richardson-3,1,Graham Richardson,,,,,,,,,,,,,,,,,,,,,,,,,0
4633527,1987,06/806765,1985,1,1,1,1,1,CAIRNS & BROTHER INC.,0,US,Clifton,NJ,Passaic,A,1,1,0,1,fl:ca_ln:ehring-1,0,Carolyn C. Ehring,,,,,,,,,,,,,,,,,,,,,,,,,0
4633528,1987,06/635638,1984,1,0,0,1,1,,0,,,,,B F,1,1,1,0,fl:ra_ln:brandt-9,1,Raymond W. Brandt,,,,,,,,,,,,,,,,,,,,,,,,,
4633529,1987,06/697213,1985,1,0,0,1,1,,0,,,,,A,1,1,1,0,fl:st_ln:litz-1,1,Steven D. Litz,,,,,,,,,,,,,,,,,,,,,,,,,
4633530,1987,06/772321,1985,1,0,0,1,1,,0,,,,,A,1,1,1,0,fl:ro_ln:satterfield-1,1,Roy E. Satterfield,,,,,,,,,,,,,,,,,,,,,,,,,
4633531,1987,06/730357,1985,1,1,1,1,1,"SCHUTT MANUFACTURING CO., INC.",0,US,Litchfield,IL,Montgomery,A,1,1,1,0,fl:ke_ln:nimmons-1,1,Kenneth W. Nimmons,,,,,,,,,,,,,,,,,,,,,,,,,0
4633532,1987,06/648343,1984,1,1,1,1,1,HONDA GIKEN KOGYO KABUSHIKI KAISHA,0,JP,Tokyo,,,A,1,1,1,0,fl:ak_ln:yagasaki-2,1,Akio Yagasaki,,,,,,,,,,,,,,,,,,,,,,,,,0
4633533,1987,06/825318,1986,1,0,0,1,1,,0,,,,,E,1,1,1,0,fl:fr_ln:meehan-1,1,Frank Meehan,,,,,,,,,,,,,,,,,,,,,,,,,
4633534,1987,06/602321,1984,1,0,0,1,1,,0,,,,,E,1,1,1,0,fl:ro_ln:hardman-1,1,Ronald P. Hardman,,,,,,,,,,,,,,,,,,,,,,,,,
4633535,1987,06/758219,1985,1,0,0,1,1,,0,,,,,A,1,1,1,0,ngktfl7w7t7rhg7dlmo2ioifm,1,Jarmo Louvo,,,,,,,,,,,,,,,,,,,,,,,,,
4633536,1987,06/567997,1984,1,0,0,1,1,,0,,,,,A E,1,1,1,0,wwdkkxmhqg5sevjjlp3ueg29l,1,Bobby J. Tribble-DuBose,,,,,,,,,,,,,,,,,,,,,,,,,
4633537,1987,06/730631,1985,1,0,0,1,1,,0,,,,,A,1,1,1,0,fl:ra_ln:smith-35,1,Ralph Smith,,,,,,,,,,,,,,,,,,,,,,,,,
4633538,1987,06/700513,1985,1,1,1,1,1,SALTEL INDUSTRIES,0,GB,Gloucester,,,A,1,1,1,0,fl:da_ln:james-8,1,David R. James,,,,,,,,,,,,,,,,,,,,,,,,,0
4633539,1987,06/706508,1985,1,1,1,1,1,ORTHOMATIC LIMITED,0,GB,Renfrew,,,A,1,1,1,0,fl:ro_ln:morrison-26,1,Ronald F. Morrison,,,,,,,,,,,,,,,,,,,,,,,,,0
4633540,1987,06/728753,1985,1,1,1,1,1,DYCKERHOFF & WIDMANN AKTIENGESELLSCHAFT,0,US,,KS,Decatur County,E,3,3,3,0,fl:di_ln:jungwirth-1,1,Dieter Jungwirth,fl:ge_ln:thielen-2,1,Gerd Thielen,fl:ot_ln:langwadt-1,1,Otmar Langwadt,,,,,,,,,,,,,,,,,,,0
4633541,1987,06/647914,1984,1,1,1,1,1,"COOPER INDUSTRIES, INC.",0,US,Houston,TX,Harris County,A,1,1,1,0,fl:th_ln:block-4,1,Thomas S. Block,,,,,,,,,,,,,,,,,,,,,,,,,0
4633542,1987,06/722445,1985,1,1,1,1,1,LABORATOIRES PHARMASCIENCE,0,FR,Courbevoie,,,A,1,1,1,0,8vc1b9bcrih4rmjqngn6g78ag,1,Bernard Taravel,,,,,,,,,,,,,,,,,,,,,,,,,0
4633543,1987,06/670553,1984,1,1,1,1,1,ROYAL APPLIANCE MFG. CO.,0,US,Cleveland,OH,Cuyahoga,A,3,3,3,0,fl:jo_ln:sovis-1,1,John F. Sovis,fl:ro_ln:smith-212,1,Robert M. Smith,fl:ge_ln:bramhall-1,1,George H. Bramhall,,,,,,,,,,,,,,,,,,,0
4633544,1987,06/711229,1985,1,1,1,1,1,P & H SALES CO.,0,US,Montebello,CA,Los Angeles,B,1,1,0,1,fl:ji_ln:hicks-1,0,Jimmy L. Hicks,,,,,,,,,,,,,,,,,,,,,,,,,0
4633545,1987,06/575508,1984,1,0,0,1,1,,0,,,,,E,1,1,1,0,fl:da_ln:schiller-7,1,Darrell Schiller,,,,,,,,,,,,,,,,,,,,,,,,,
4633546,1987,06/712559,1985,1,1,1,1,1,WAGEMANS MASTRICHT B.V.,0,NL,,,,A,1,1,1,0,kbnuylzyd70uil0a0pz7869yq,1,Franciscus H. Bergs,,,,,,,,,,,,,,,,,,,,,,,,,0
4633547,1987,06/724184,1985,1,1,1,1,1,CAROON BROTHERS SEAFOOD,0,US,Lowland,NC,Pamlico,A,1,0,0,0,fl:li_ln:caroon-1,,Linald R. Caroon,,,,,,,,,,,,,,,,,,,,,,,,,0
4633548,1987,06/658506,1984,1,0,0,1,1,,0,,,,,A,3,3,3,0,fl:le_ln:siskind-1,1,Leland B. M. Siskind,fl:wi_ln:samaha-1,1,William A. Samaha,fl:th_ln:warshaw-1,1,Thayer S. Warshaw,,,,,,,,,,,,,,,,,,,
4633549,1987,06/738636,1985,1,1,1,1,1,ITW FASTEX ITALIA S.P.A.,0,IT,Torino,,,A,1,1,1,0,fl:at_ln:lovato-1,1,Attilio Lovato,,,,,,,,,,,,,,,,,,,,,,,,,0
4633550,1987,06/717405,1985,1,1,1,1,1,BASF AKTIENGESELLSCHAFT,0,DE,,,,D,2,2,2,0,fl:jo_ln:mcaliley-1,1,John E. McAliley,fl:ja_ln:crozier-3,1,"James R. Crozier, Jr.",,,,,,,,,,,,,,,,,,,,,,0
4633551,1987,06/627836,1984,1,1,1,1,1,L.C.C.-C.I.C.E.-COMPAGNIE EUROPEENNE DE COMPOSANTS ELECTRONIQUES,0,FR,Bagnolet,,,H,1,0,0,0,fl:da_ln:bernard-5,,Daniel Bernard,,,,,,,,,,,,,,,,,,,,,,,,,0
4633552,1987,06/716245,1985,1,0,0,1,1,,0,,,,,B,1,1,1,0,fl:ka_ln:eriksson-8,1,Karl-Erik Eriksson,,,,,,,,,,,,,,,,,,,,,,,,,
4633553,1987,06/756874,1985,1,0,0,1,1,,0,,,,,B,2,2,2,0,wpkc5ed28idqxhh3uncm4m4rp,1,Constantine P. Chronis,fl:pa_ln:chronis-2,1,Patrick F. Chronis,,,,,,,,,,,,,,,,,,,,,,
4633554,1987,06/763744,1985,1,1,1,1,1,WESTINGHOUSE ELECTRIC CORP.,0,US,Pittsburgh,PA,Allegheny,B,2,2,2,0,fl:ro_ln:clark-32,1,Robert E. Clark,fl:de_ln:amos-2,1,Dennis R. Amos,,,,,,,,,,,,,,,,,,,,,,0
4633555,1987,06/721581,1985,1,0,0,1,1,,0,,,,,B,1,1,1,0,fl:ge_ln:legge-1,1,Gerald A. Legge,,,,,,,,,,,,,,,,,,,,,,,,,
4633556,1987,06/707692,1985,1,1,1,1,1,BRIGGS & STRATTON CORPORATION,0,US,Wauwatosa,WI,Milwaukee County,B,1,1,1,0,fl:jo_ln:santi-1,1,John D. Santi,,,,,,,,,,,,,,,,,,,,,,,,,0
4633557,1987,06/710166,1985,1,1,1,1,1,KABUSHIKI KAISHA TOSHIBA,0,JP,,,,B,1,1,1,0,fl:yu_ln:kanemitsu-1,1,Yukio Kanemitsu,,,,,,,,,,,,,,,,,,,,,,,,,0
4633558,1987,06/833549,1986,1,1,1,1,1,"WITTEK INDUSTRIES, INC.",0,US,Broadview,IL,Cook,B,1,1,1,0,fl:ge_ln:spaulding-1,1,George E. Spaulding,,,,,,,,,,,,,,,,,,,,,,,,,0
4633559,1987,06/712671,1985,1,1,1,1,1,MICHAEL LADNEY,1,US,Grosse Pointe Shores,MI,Wayne County,B,1,1,1,0,fl:no_ln:loren-1,1,Norman S. Loren,,,,,,,,,,,,,,,,,,,,,,,,,0
4633560,1987,06/773387,1985,1,1,1,1,1,MULTIFASTENER CORPORATION,0,US,Detroit,MI,Wayne,B,1,0,0,0,fl:ru_ln:muller-3,,Rudolph R. M. Muller,,,,,,,,,,,,,,,,,,,,,,,,,0
4633561,1987,06/790421,1985,1,0,0,1,1,,0,,,,,B,1,1,1,0,vz48x23tz9rd4lzegorir1orm,1,Ramon Grabel,,,,,,,,,,,,,,,,,,,,,,,,,
4633562,1987,06/688064,1984,1,0,0,1,1,,0,,,,,B,1,1,1,0,fl:jo_ln:ulsh-1,1,John R. Ulsh,,,,,,,,,,,,,,,,,,,,,,,,,
4633563,1987,06/793216,1985,1,0,0,1,1,,0,,,,,B,1,1,1,0,fl:st_ln:rykaczewski-1,1,Stanley Rykaczewski,,,,,,,,,,,,,,,,,,,,,,,,,
4633564,1987,06/594696,1984,1,0,0,1,1,,0,,,,,B,1,1,1,0,fl:ch_ln:sauber-2,1,Charles J. Sauber,,,,,,,,,,,,,,,,,,,,,,,,,
4633565,1987,06/787994,1985,1,1,1,1,1,"BARNHART INDUSTRIES, INC.",0,US,Barnhart,MO,Jefferson,A B,1,1,1,0,fl:ir_ln:dewoskin-1,1,Irvin S. DeWoskin,,,,,,,,,,,,,,,,,,,,,,,,,0
4633566,1987,06/719866,1985,1,1,1,1,1,GENERAL ELECTRIC COMPANY,0,US,Philadelphia,PA,Philadelphia,B,1,1,1,0,fl:an_ln:coppa-1,1,Anthony P. Coppa,,,,,,,,,,,,,,,,,,,,,,,,,0
4633567,1987,06/606361,1984,1,1,1,1,1,MEGICA CORPORATION,0,US,Hackettstown,NJ,Warren,B C,1,1,1,0,fl:an_ln:montalbano-4,1,Anthony J. Montalbano,,,,,,,,,,,,,,,,,,,,,,,,,0
4633568,1987,06/755376,1985,1,1,1,1,1,VIANINI INDUSTRIA S.P.A.,0,IT,Roma,,,B,2,2,2,0,fl:se_ln:marchesi-1,1,Sergio Marchesi,fl:gi_ln:fachin-1,1,Gino Fachin,,,,,,,,,,,,,,,,,,,,,,0
4633569,1987,06/545012,1983,1,1,1,1,1,COGEMA ET FRAMATOME,0,FR,Vélizy-Villacoublay,,,B,3,3,3,0,fl:be_ln:vere-1,1,Bernard Vere,fl:pa_ln:mathevon-1,1,Paul Mathevon,0gruabebfs7sx5raag9g6u6sv,1,Michel Decarsin,,,,,,,,,,,,,,,,,,,0
4633570,1987,06/748097,1985,1,1,1,1,1,AMP INCORPORATED,0,US,Harrisburg,PA,Dauphin,H,6,5,3,2,fl:ri_ln:burgit-1,1,Richard A. Burgit,fl:ne_ln:davis-1,0,Newton G. Davis,fl:jo_ln:goyert-1,,Josita M. Goyert,fl:ke_ln:johnson-124,0,Keith A. Johnson,fl:ro_ln:long-13,1,Robert A. Long,fl:jo_ln:stachura-1,1,Joseph F. Stachura,,,,,,,,,,0
4633571,1987,06/782911,1985,1,1,1,1,1,AT&T BELL LABORATORIES,0,US,New Providence,NJ,Union,H,1,1,1,0,fl:ke_ln:kolwicz-1,1,Kevin D. Kolwicz,,,,,,,,,,,,,,,,,,,,,,,,,0
4633572,1987,06/790382,1985,1,1,1,1,1,GENERAL MOTORS CORPORATION,0,US,Detroit,MI,Wayne,H,4,4,4,0,fl:ra_ln:rusch-1,1,Randy A. Rusch,fl:do_ln:kittle-2,1,Douglas A. Kittle,fl:be_ln:ulfers-2,1,Bernhard G. Ulfers,fl:st_ln:inman-1,1,Stephen L. Inman,,,,,,,,,,,,,,,,0
4633573,1987,06/613367,1984,1,1,1,1,1,"AEGIS, INC.",0,US,New Bedford,MA,Bristol,H,1,1,1,0,fl:je_ln:scherer-4,1,Jeremy D. Scherer,,,,,,,,,,,,,,,,,,,,,,,,,0
4633574,1987,06/717347,1985,1,1,1,1,1,CANADIAN GENERAL ELECTRIC COMPANY LIMITED,0,CA,Toronto,ON,,H,2,2,2,0,fl:du_ln:bath-1,1,Duncan T. Bath,fl:ja_ln:ferguson-13,1,James H. Ferguson,,,,,,,,,,,,,,,,,,,,,,0
4633575,1987,06/712775,1985,1,0,0,1,1,,0,,,,,H,1,1,1,0,fl:fr_ln:veser-1,1,Franz Veser,,,,,,,,,,,,,,,,,,,,,,,,,
4633576,1987,06/623750,1984,1,1,1,1,1,"YAMAMOTO ELECTRIC INDUSTRIAL CO., LTD.",0,JP,Fukushima,,,H,1,1,1,0,fl:ta_ln:kuwana-5,1,Tadashi Kuwana,,,,,,,,,,,,,,,,,,,,,,,,,0
4633577,1987,06/662710,1984,1,1,1,1,1,GLOBE PRODUCTS INC.,0,US,Dayton,OH,Montgomery,H,1,1,1,0,fl:al_ln:banner-1,1,Alvin C. Banner,,,,,,,,,,,,,,,,,,,,,,,,,0
4633578,1987,06/556800,1983,1,0,0,1,1,,0,,,,,G H,2,2,2,0,fl:ha_ln:aine-1,1,Harry E. Aine,fl:ba_ln:block-1,1,Barry Block,,,,,,,,,,,,,,,,,,,,,,
4633579,1987,06/835402,1986,1,1,1,1,1,TEXAS INSTRUMENTS INCORPORATED,0,US,Dallas,TX,Dallas County,H,1,1,1,0,fl:we_ln:strasser-1,1,Werner Strasser,,,,,,,,,,,,,,,,,,,,,,,,,0
4633580,1987,06/763625,1985,1,1,1,1,1,YOSHIDA KOGYO K.K.,0,JP,Tokyo,,,A,3,3,3,0,fl:ke_ln:yoshieda-1,1,Keiichi Yoshieda,fl:to_ln:sodeno-1,1,Toshiaki Sodeno,fl:sy_ln:honmoto-1,1,Syuichi Honmoto,,,,,,,,,,,,,,,,,,,0
4633581,1987,06/665013,1984,1,0,0,1,1,,0,,,,,B,1,1,1,0,fl:el_ln:villanueva-1,1,Eliseo H. Villanueva,,,,,,,,,,,,,,,,,,,,,,,,,
4633582,1987,06/765582,1985,1,1,1,1,1,GENERAL INSTRUMENT CORPORATION,0,US,New York,NY,New York County,H,4,3,3,0,fl:st_ln:ching-1,1,Steve Ching,fl:fr_ln:babbitt-1,1,"Frank B. Babbitt, Jr.",fl:ad_ln:merchant-2,1,Adnan I. Merchant,r46d44brm4uxs3b3sc6xd4yk9,,Putt C. Yong,,,,,,,,,,,,,,,,0
4633583,1987,06/664968,1984,1,1,1,1,1,"SUMITOMO METAL MINING CO., LTD.",0,JP,Tokyo,,,H,1,0,0,0,fl:yo_ln:kato-59,,Yoshihisa Kato,,,,,,,,,,,,,,,,,,,,,,,,,0
4633584,1987,06/703356,1985,1,1,1,1,1,MOLEX INCORPORATED,0,US,Lisle,IL,DuPage,H,3,3,3,0,fl:st_ln:wright-10,1,Steven F. Wright,fl:er_ln:stenstrom-1,1,Eric Stenstrom,fl:jo_ln:wolyn-1,1,Joseph Wolyn,,,,,,,,,,,,,,,,,,,0
4633585,1987,06/702081,1985,1,0,0,1,1,,0,,,,,B,2,2,2,0,fl:ja_ln:whitaker-1,1,James Lee Whitaker,fl:ja_ln:fultz-2,1,James Fultz,,,,,,,,,,,,,,,,,,,,,,
4633586,1987,06/715857,1985,1,1,1,1,1,J. M. HUBER CORPORATION,0,US,Rumson,NJ,Monmouth,B,3,2,2,0,nvtdq6udcau4taaobotc87lj5,1,James M. Yawn,elbdj9zmlomuox9yhv4929rvo,,Huby M. Whitaker,fl:fr_ln:bridgers-1,1,Frank Bridgers,,,,,,,,,,,,,,,,,,,0
4633587,1987,06/741326,1985,1,1,1,1,1,WILKINSON SWORD LIMITED OF SWORD HOUSE,0,GB,Paragon Road,,,B,1,1,1,0,fl:ch_ln:harrison-13,1,Christopher R. B. Harrison,,,,,,,,,,,,,,,,,,,,,,,,,0
4633588,1987,06/753408,1985,1,0,0,1,1,,0,,,,,A,1,1,1,0,fl:ch_ln:pittinger-2,1,"Charles B. Pittinger, Jr.",,,,,,,,,,,,,,,,,,,,,,,,,
4633589,1987,06/665351,1984,1,1,1,1,1,R. RICK RODIG,1,US,Denair,CA,Stanislaus,B,1,0,0,0,fl:ja_ln:gray-12,,James W. Gray,,,,,,,,,,,,,,,,,,,,,,,,,0
4633590,1987,06/747204,1985,1,1,1,1,1,THE UNITED STATES OF AMERICA AS REPRESENTED BY THE SECRETARY OF THE AIR FORCE,0,US,Washington,DC,District of Columbia,G,1,1,1,0,fl:pa_ln:lagasse-1,1,Paul Lagasse,,,,,,,,,,,,,,,,,,,,,,,,,0
4633591,1987,06/792282,1985,1,0,0,1,1,,0,,,,,B,1,1,1,0,ryrbv4x25pyfa6cc2ql5gtab4,1,Alfred J. Pikora,,,,,,,,,,,,,,,,,,,,,,,,,
4633592,1987,06/730720,1985,1,0,0,1,1,,0,,,,,B,1,1,1,0,fl:ma_ln:wahli-1,1,Marcel Wahli,,,,,,,,,,,,,,,,,,,,,,,,,
4633593,1987,06/739740,1985,1,0,0,1,1,,0,,,,,F,1,1,1,0,fl:br_ln:wallis-2,1,Bruce Wallis,,,,,,,,,,,,,,,,,,,,,,,,,
4633594,1987,06/792982,1985,1,0,0,1,1,,0,,,,,F,1,1,1,0,f0fhe7yd90vzww0yhmwaar32f,1,Enrico Bovone,,,,,,,,,,,,,,,,,,,,,,,,,
4633595,1987,06/793325,1985,1,1,1,1,1,VANDENBROEK INTERNATIONAL B.V.,0,NL,,,,F,1,1,1,0,fl:ad_ln:vandenbroek-1,1,Adriaan van den Broek,,,,,,,,,,,,,,,,,,,,,,,,,0
4633596,1987,06/298320,1981,1,1,1,1,1,ALBANY INTERNATIONAL CORP.,0,US,Menands,NY,Town of Colonie,F,1,1,1,0,fl:mi_ln:josef-2,1,Michael J. Josef,,,,,,,,,,,,,,,,,,,,,,,,,0
4633597,1987,06/586701,1984,1,0,0,1,1,,0,,,,,A,1,0,0,0,fl:jo_ln:shiang-1,,Joung-Lin Shiang,,,,,,,,,,,,,,,,,,,,,,,,,
4633598,1987,06/650529,1984,1,1,1,1,1,HITACHI HIGH-TECHNOLOGIES CORPORATION,0,JP,Tokyo,,,A,2,2,2,0,fl:yo_ln:moronaga-1,1,Yoshiharu Moronaga,fl:ju_ln:izumi-2,1,Junji Izumi,,,,,,,,,,,,,,,,,,,,,,0
4633599,1987,06/767391,1985,1,1,1,1,1,SALOMON S.A.,0,FR,Annecy,,,A,3,3,3,0,fl:jo_ln:morell-2,1,Joseph Morell,fl:lo_ln:benoit-2,1,Louis Benoit,fl:ma_ln:bonnet-5,1,Maurice Bonnet,,,,,,,,,,,,,,,,,,,0
4633600,1987,06/830861,1986,1,1,1,1,1,PUMA AG RUDOLF DASSLER SPORT,0,DE,,,,A,2,2,2,0,fl:ar_ln:dassler-1,1,Armin A. Dassler,fl:wi_ln:bauer-14,1,Willi Bauer,,,,,,,,,,,,,,,,,,,,,,0
4633601,1987,06/654371,1984,1,1,1,1,1,ESCO CORPORATION,0,US,Portland,OR,Multnomah County,E,2,2,2,0,fl:ro_ln:fleck-5,1,Robert S. Fleck,fl:jo_ln:kreitzberg-1,1,John S. Kreitzberg,,,,,,,,,,,,,,,,,,,,,,0
4633602,1987,06/771840,1985,1,0,0,1,1,,0,,,,,E,2,2,1,1,fl:ri_ln:layh-1,1,Ricky L. Layh,fl:ch_ln:landrum-4,0,"Christy B. Landrum, Jr.",,,,,,,,,,,,,,,,,,,,,,
4633603,1987,06/698754,1985,1,0,0,1,1,,0,,,,,E,1,1,1,0,fl:pi_ln:david-3,1,Pierre David,,,,,,,,,,,,,,,,,,,,,,,,,
4633604,1987,06/803416,1985,1,1,1,1,1,RUSSELL CORPORATION,0,US,Alexander City,AL,Tallapoosa,D,2,1,1,0,fl:fl_ln:adamson-1,1,Fletcher D. Adamson,fl:ja_ln:caldwell-15,,James M. Caldwell,,,,,,,,,,,,,,,,,,,,,,0
4633605,1987,06/735506,1985,1,0,0,1,1,,0,,,,,G,1,1,0,1,fl:yo_ln:kang-192,0,Young Wook Kang,,,,,,,,,,,,,,,,,,,,,,,,,
4633606,1987,06/722727,1985,1,1,1,1,1,ALLFLEX INTERNATIONAL LIMITED,0,NZ,Tauranga,,,A G,1,1,0,1,fl:li_ln:cohr-1,0,Lindsay W. J. Cohr,,,,,,,,,,,,,,,,,,,,,,,,,0
4633607,1987,06/650255,1984,1,1,1,1,1,"A.R. BRASCH ADVERTISING, INC.",0,US,Southfield,MI,Oakland,G,2,2,2,0,fl:mi_ln:brasch-2,1,Miles E. Brasch,fl:al_ln:campbell-14,1,"Allan G. Campbell, III",,,,,,,,,,,,,,,,,,,,,,0
4633608,1987,06/722511,1985,1,0,0,1,1,,0,,,,,A,1,1,1,0,lk96uss4tj1zfasfetjma1oub,1,Richard Savarino,,,,,,,,,,,,,,,,,,,,,,,,,
4633609,1987,06/688713,1985,1,0,0,1,1,,0,,,,,A,1,1,1,0,fl:ia_ln:brown-9,1,Ian A. Brown,,,,,,,,,,,,,,,,,,,,,,,,,
4633610,1987,06/729918,1985,1,0,0,1,1,,0,,,,,A,1,1,1,0,fl:ro_ln:thompson-49,1,Robert R. Thompson,,,,,,,,,,,,,,,,,,,,,,,,,
4633611,1987,06/687804,1984,1,1,1,1,1,BAKISH MATERIALS CORPORATION,0,US,Englewood,NJ,Bergen,A,3,3,3,0,fl:si_ln:schiller-1,1,Siegfried Schiller,fl:si_ln:panzer-1,1,Siegfried Panzer,fl:kl_ln:gaber-1,1,Klaus Gaber,,,,,,,,,,,,,,,,,,,0
4633612,1987,06/784354,1985,1,0,0,1,1,,0,,,,,E,1,1,1,0,v6dwm845h958ujslg8zsc08ez,1,Robert L. Forkish,,,,,,,,,,,,,,,,,,,,,,,,,
4633613,1987,06/679274,1984,1,1,1,1,1,"OHI SEISAKUSHO CO., LTD.",0,JP,Yokohama,,,E,2,2,2,0,fl:fu_ln:kobayashi-21,1,Fumio Kobayashi,fl:ju_ln:yamagishi-4,1,Jun Yamagishi,,,,,,,,,,,,,,,,,,,,,,0
4633614,1987,06/720514,1985,1,1,1,1,1,USG CORPORATION,0,US,Chicago,IL,Cook County,E,1,1,1,0,fl:ro_ln:vanweelden-1,1,Roger M. Van Weelden,,,,,,,,,,,,,,,,,,,,,,,,,0
4633615,1987,06/752668,1985,1,1,1,1,1,"WATSCO COMPONENTS, INC.",0,US,Hialeah,FL,Miami-Dade,E,1,1,1,0,q8aai7m869uvkr1p4g2sqagxm,1,James R. Moose,,,,,,,,,,,,,,,,,,,,,,,,,0
4633616,1987,06/627687,1984,1,1,1,1,1,DONAT FLAMAND INC.,0,CA,Surf Inlet,BC,,E,1,1,1,0,fl:je_ln:giguere-3,1,Jean-Paul Giguere,,,,,,,,,,,,,,,,,,,,,,,,,0
4633617,1987,06/670846,1984,1,1,1,1,1,VAN DOORNE'S TRANSMISSIE B.V.,0,NL,Tilburg,,,B,1,1,1,0,fl:jo_ln:vandijk-4,1,Johannes A. van Dijk,,,,,,,,,,,,,,,,,,,,,,,,,0
4633618,1987,06/689240,1985,1,1,1,1,1,"KOKEN CO., LTD.",0,JP,Yokohama,,,B,1,1,1,0,fl:ta_ln:kobayashi-128,1,Takahide Kobayashi,,,,,,,,,,,,,,,,,,,,,,,,,0
4633619,1987,06/754791,1985,1,1,1,1,1,CARL HURTH MASCHINEN- UND ZAHNRADFABRIK GMBH & CO.,0,DE,Munich,,,B,3,2,2,0,fl:ma_ln:erhardt-3,,Manfred Erhardt,fl:he_ln:loos-6,1,Herbert Loos,fl:ge_ln:reichert-2,1,Gerhard Reichert,,,,,,,,,,,,,,,,,,,0
4633620,1987,06/788080,1985,1,1,1,1,1,MAGNAFLUX CORPORATION,0,US,Chicago,IL,Cook County,B,2,2,2,0,fl:do_ln:lorenzi-1,1,Donald E. Lorenzi,fl:he_ln:wagerer-1,1,Helmut F. Wagerer,,,,,,,,,,,,,,,,,,,,,,0
4633621,1987,06/796043,1985,1,0,0,1,1,,0,,,,,B,1,1,1,0,fl:ra_ln:weber-12,1,Raymond Weber,,,,,,,,,,,,,,,,,,,,,,,,,
4633622,1987,06/738669,1985,1,1,1,1,1,"WALKER PEENIMPAC MACHINE, INC.",0,US,Valdosta,GA,Lowndes,B,1,1,1,0,u40dpq9hpgefohv6pveqpepj4,1,Raymond Lightsey,,,,,,,,,,,,,,,,,,,,,,,,,0
4633623,1987,06/475514,1983,1,1,1,1,1,COMMISSARIAT A L'ENERGIE ATOMIQUE,0,FR,Paris,,,B,1,1,1,0,fl:je_ln:spitz-1,1,Jean Spitz,,,,,,,,,,,,,,,,,,,,,,,,,0
4633624,1987,06/712551,1985,1,1,1,1,1,TARGETTI SANKEY S.P.A.,0,IT,Firenze,,,E,1,1,1,0,fl:gi_ln:targetti-1,1,Giampaolo Targetti,,,,,,,,,,,,,,,,,,,,,,,,,0
4633625,1987,06/535378,1983,1,1,1,1,1,MAN GUTEHOFFNUNGSHUETTE GMBH,0,DE,Nuremberg,,,E,2,2,2,0,1bobc7fvl5imuh273h5tlhtdz,1,Peter H. Dieban,fl:he_ln:ziller-2,1,Helmut Ziller,,,,,,,,,,,,,,,,,,,,,,0
4633626,1987,06/677627,1984,1,1,1,1,1,THE BUDD COMPANY,0,US,Troy,MI,Oakland,E,2,2,2,0,fl:ri_ln:freeman-8,1,Richard B. Freeman,fl:wa_ln:eggert-1,1,"Walter S. Eggert, Jr.",,,,,,,,,,,,,,,,,,,,,,0
4633627,1987,06/649551,1984,1,1,1,1,1,GEARHART AUSTRALIA LIMITED,0,AU,Forsayth,,,E F,1,1,1,0,fl:mi_ln:tucker-14,1,Michael Tucker,,,,,,,,,,,,,,,,,,,,,,,,,0
4633628,1987,06/794249,1985,1,1,1,1,1,UNIVERSITY OF UTAH RESEARCH FOUNDATION,0,US,Salt Lake City,UT,Salt Lake,E,1,1,1,0,fl:na_ln:mostaghel-1,1,Naser Mostaghel,,,,,,,,,,,,,,,,,,,,,,,,,0
4633629,1987,06/731930,1985,1,1,1,1,1,"EARTHSHIP ENTERPRISE, INC.",0,US,Holland,MI,Ottawa County,E,1,1,1,0,fl:ri_ln:britz-1,1,Richard D. Britz,,,,,,,,,,,,,,,,,,,,,,,,,0
4633630,1987,06/833094,1986,1,1,1,1,1,G. R. BLOCK RESEARCH AND DEVELOPMENT CORPORATION,0,CA,Victoria,BC,,E,1,1,1,0,bvu3wgg8nx213othozys2h4tp,1,Stavros Kindylides,,,,,,,,,,,,,,,,,,,,,,,,,0
4633631,1987,06/749234,1985,1,1,1,1,1,"PPG INDUSTRIES OHIO, INC.",0,US,Pittsburgh,PA,Allegheny,E,1,1,1,0,fl:st_ln:crandell-1,1,Stephen L. Crandell,,,,,,,,,,,,,,,,,,,,,,,,,0
4633632,1987,06/670472,1984,1,1,1,1,1,MESSERSCHMITT-BOELKOW-BLOHM GESELLSCHAFT MIT BESCHRAENKTER HAFTUNG,0,DE,Munich,,,E,1,1,1,0,fl:br_ln:sarh-1,1,Branko Sarh,,,,,,,,,,,,,,,,,,,,,,,,,0
4633633,1987,06/777220,1985,1,1,1,1,1,BUCHTAL GESELLSCHAFT MIT BESCHRANKTER HAFTUNG,0,DE,Amberg,,,E,1,1,1,0,fl:ma_ln:bard-4,1,Martin Bard,,,,,,,,,,,,,,,,,,,,,,,,,0
4633634,1987,06/774746,1985,1,0,0,1,1,,0,,,,,E,3,3,3,0,fl:al_ln:nemmer-2,1,Albert E. Nemmer,fl:al_ln:nemmer-1,1,Albert W. Nemmer,fl:jo_ln:nemmer-2,1,Joseph E. Nemmer,,,,,,,,,,,,,,,,,,,
4633635,1987,06/624182,1984,1,1,1,1,1,HUNTER DOUGLAS INC.,0,US,Totowa,NJ,Passaic,E,1,1,1,0,fl:ri_ln:anderson-26,1,Richard N. Anderson,,,,,,,,,,,,,,,,,,,,,,,,,0
4633636,1987,06/693841,1985,1,0,0,1,1,,0,,,,,E F,1,1,1,0,fl:wi_ln:alexander-17,1,William Alexander,,,,,,,,,,,,,,,,,,,,,,,,,
4633637,1987,06/824111,1986,1,1,1,1,1,"INDUSTRIAL INSULATIONS, INC.",0,US,Walnut,CA,Orange,E F,1,1,1,0,fl:ca_ln:frahme-1,1,Carl E. Frahme,,,,,,,,,,,,,,,,,,,,,,,,,0
4633638,1987,06/562695,1983,1,1,1,1,1,TARMAC CONSTRUCTION LIMITED,0,GB,Wolverhampton,,,E,1,1,1,0,fl:de_ln:ash-2,1,Dennis E. Ash,,,,,,,,,,,,,,,,,,,,,,,,,0
4633639,1987,06/557888,1983,1,0,0,1,1,,0,,,,,E,1,1,1,0,fl:mi_ln:deimen-2,1,Michael L. Deimen,,,,,,,,,,,,,,,,,,,,,,,,,
4633640,1987,06/843560,1986,1,0,0,1,1,,0,,,,,E,1,1,1,0,fl:ge_ln:hutter-1,1,Gerhard P. Hutter,,,,,,,,,,,,,,,,,,,,,,,,,
4633641,1987,06/545377,1983,1,1,1,1,1,DOUBRAVA KG,0,AT,,,,E,1,1,1,0,vgf8prp09y2tae33pqbp4mtxu,1,Johann Heinbuchner,,,,,,,,,,,,,,,,,,,,,,,,,0
4633642,1987,06/783441,1985,1,1,1,1,1,SOCIETA'INTERNAZIONALE APPLICAZIONI TECHNICHE S.P.A.,0,IT,Saronno,,,B,1,1,1,0,fl:ad_ln:lissoni-1,1,Adelio Lissoni,,,,,,,,,,,,,,,,,,,,,,,,,0
4633643,1987,06/304187,1981,1,1,1,1,1,THE MEAD CORPORATION,0,US,Atlanta,GA,Fulton County,B,1,1,0,1,fl:pr_ln:wood-1,0,Prentice J. Wood,,,,,,,,,,,,,,,,,,,,,,,,,0
4633644,1987,06/775557,1985,1,1,1,1,1,ALCATEL CIT,0,FR,Paris,,,B,2,2,2,0,fl:je_ln:haroutel-1,1,Jean-Claude Haroutel,sqsavr20ndqp54yj1kubofity,1,Christian Galceran,,,,,,,,,,,,,,,,,,,,,,0
4633645,1987,06/514234,1983,1,1,1,1,1,"SHIKOKU KAKOKI CO., LTD.",0,JP,Tokushima,,,B,1,1,0,1,fl:ka_ln:joo-5,0,Katsuhiro Joo,,,,,,,,,,,,,,,,,,,,,,,,,0
4633646,1987,06/792579,1985,1,1,1,1,1,ALUMINUM COMPANY OF AMERICA,0,US,Pittsburgh,PA,Allegheny,B,2,2,2,0,fl:da_ln:ellis-34,1,Darwin L. Ellis,fl:fr_ln:kelly-13,1,Frank Kelly,,,,,,,,,,,,,,,,,,,,,,0
4633647,1987,06/709724,1985,1,1,1,1,1,THE MEAD PACKAGING CORPORATION,0,US,Dayton,OH,Montgomery,B,1,1,1,0,fl:ro_ln:ganz-1,1,Robert H. Ganz,,,,,,,,,,,,,,,,,,,,,,,,,0
4633648,1987,06/730489,1985,1,1,1,1,1,MINNESOTA MINING AND MANUFACTURING COMPANY,0,US,Saint Paul,MN,Ramsey,B,1,0,0,0,fl:wi_ln:yeung-11,,Wing W. Yeung,,,,,,,,,,,,,,,,,,,,,,,,,0
4633649,1987,06/758648,1985,1,0,0,1,1,,0,,,,,B,2,2,2,0,fl:pa_ln:gautier-6,1,Paoul Louis A. Gautier,fl:mi_ln:cazes-1,1,Michel Cazes,,,,,,,,,,,,,,,,,,,,,,
4633650,1987,06/785528,1985,1,1,1,1,1,BRODERNA SOLBERGS FORSALJNINGS AKTIEBOLAG,0,SE,Forshaga,,,B,2,2,2,0,su09bgrhk6wyf242iwswciku8,1,Jan-Henrik Sohlberg,m6yszrk87ymlgd71mhel5fw3i,1,Seth I. S. Olsson,,,,,,,,,,,,,,,,,,,,,,0
4633651,1987,06/705905,1985,1,0,0,1,1,,0,,,,,B,1,1,1,0,fl:ra_ln:edmunds-2,1,Raymond S. Edmunds,,,,,,,,,,,,,,,,,,,,,,,,,
4633652,1987,06/826000,1986,1,1,1,1,1,LES EPICIERS UNIS METRO-RICHELIEU INC.,0,CA,Montréal,QC,,B,3,3,3,0,di28ih227c6alpfymmpyjk41x,1,Georges Dagenais,fl:gh_ln:michaud-1,1,Ghislain Michaud,fl:mi_ln:presseau-1,1,Michel Presseau,,,,,,,,,,,,,,,,,,,0
4633653,1987,06/666046,1984,1,0,0,1,1,,0,,,,,B,2,1,1,0,fl:jo_ln:roberts-22,,John T. Roberts,fl:ph_ln:reid-6,1,Philip L. Reid,,,,,,,,,,,,,,,,,,,,,,
4633654,1987,06/628908,1984,1,1,1,1,1,"TOKYO AUTOMATIC MACHINERY WORKS, LTD.",0,JP,Tokyo,,,B,2,2,2,0,fl:mi_ln:sato-60,1,Minoru Sato,fl:ta_ln:kanai-17,1,Takayuki Kanai,,,,,,,,,,,,,,,,,,,,,,0
4633655,1987,06/602527,1984,1,1,1,1,1,"NIGRELLI SYSTEMS, INC.",0,US,Kiel,WI,Manitowoc County,B,1,1,1,0,fl:bi_ln:nigrelli-1,1,Biagio J. Nigrelli,,,,,,,,,,,,,,,,,,,,,,,,,0
4633656,1987,06/820574,1986,1,1,1,1,1,KUHN S.A.,0,FR,Saverne,,,A,1,1,1,0,fl:jo_ln:willinger-3,1,Joseph Willinger,,,,,,,,,,,,,,,,,,,,,,,,,0
4633657,1987,06/530074,1983,1,1,1,1,1,CLAAS SAULGAU GMBH,0,DE,Bad Saulgau,,,A,1,1,1,0,fl:ru_ln:arnold-1,1,Rudolf Arnold,,,,,,,,,,,,,,,,,,,,,,,,,0
4633658,1987,06/729637,1985,1,1,1,1,1,"OPPAMA INDUSTRY CO., LTD.",0,JP,Yokosuka,,,A,1,1,1,0,fl:ma_ln:nogawa-8,1,Masato Nogawa,,,,,,,,,,,,,,,,,,,,,,,,,0
4633659,1987,06/695319,1985,1,1,1,1,1,DEERE & COMPANY,0,US,Moline,IL,Rock Island,A,2,2,2,0,fl:he_ln:anstey-1,1,Henry D. Anstey,fl:je_ln:viaud-1,1,Jean Viaud,,,,,,,,,,,,,,,,,,,,,,0
4633660,1987,06/770209,1985,1,1,1,1,1,SCHUBERT & SALZER,0,DE,Ingolstadt,,,D,3,3,3,0,fl:pe_ln:artzt-1,1,Peter Artzt,fl:ge_ln:egbers-1,1,Gerhard Egbers,fl:ha_ln:rottmayr-1,1,Hans Rottmayr,,,,,,,,,,,,,,,,,,,0
4633661,1987,06/738045,1985,1,1,1,1,1,FAG KUGELFISCHER GEORG SCHAFER (KGAA),0,DE,,,,D,2,1,1,0,fl:gu_ln:paul-3,1,Gunther Paul,fl:ki_ln:patel-21,,Kirit Patel,,,,,,,,,,,,,,,,,,,,,,0
4633662,1987,06/779114,1985,1,1,1,1,1,"MITSUBISHI RAYON CO., LTD.",0,JP,Tokyo,,,D,5,5,3,2,fl:ma_ln:toki-7,1,Masahisa Toki,fl:se_ln:satoh-6,1,Seiji Satoh,fl:yo_ln:matsui-9,0,Yoshiaki Matsui,fl:ku_ln:morihata-1,1,Kunio Morihata,fl:to_ln:murata-5,0,Toyoji Murata,,,,,,,,,,,,,0
4633663,1987,06/747791,1985,1,1,1,1,1,HEBERLEIN HISPANO SA,0,CH,Vernier,,,D,1,1,1,0,fl:lo_ln:vignon-1,1,Louis Vignon,,,,,,,,,,,,,,,,,,,,,,,,,0
4633664,1987,06/619845,1984,1,0,0,1,1,,0,,,,,D,2,2,2,0,d06ffis8zokibswa7jqfszy79,1,Hans-Friedrich Mueller-Storz,fl:er_ln:bock-4,1,Erich Bock,,,,,,,,,,,,,,,,,,,,,,
4633665,1987,06/684846,1984,1,0,0,1,1,,0,,,,,F,2,2,2,0,fl:jo_ln:buter-1,1,Josef Buter,fl:he_ln:buter-2,1,Heinrich Buter,,,,,,,,,,,,,,,,,,,,,,
4633666,1987,06/653741,1984,1,1,1,1,1,KABUSHIKI KAISHA KOMATSU SEISAKUSHO,0,JP,Tokyo,,,F,1,1,1,0,fl:ta_ln:karakama-2,1,Tadao Karakama,,,,,,,,,,,,,,,,,,,,,,,,,0