patent_number,grant_year,application_number,application_year,d_inventor,d_assignee,d_location,d_application,d_ipc,assignee,assignee_ind,country,city,state,county,ipc_section,team_size,inventors,men_inventors,women_inventors,inventor_id1,male_flag1,inventor_name1,inventor_id2,male_flag2,inventor_name2,inventor_id3,male_flag3,inventor_name3,inventor_id4,male_flag4,inventor_name4,inventor_id5,male_flag5,inventor_name5,inventor_id6,male_flag6,inventor_name6,inventor_id7,male_flag7,inventor_name7,inventor_id8,male_flag8,inventor_name8,inventor_id9,male_flag9,inventor_name9,assignee_sequence
4980927,1991,07/285619,1988,1,1,1,1,1,MINNESOTA MINING AND MANUFACTURING COMPANY,0,US,Windom,MN,Cottonwood,A,3,3,3,0,fl:al_ln:wawiluk-1,1,Alex Anthony Wawiluk,fl:ha_ln:seppala-2,1,Harold J. Seppala,fl:ar_ln:fry-4,1,Arthur L. Fry,,,,,,,,,,,,,,,,,,,0
4980928,1991,07/257702,1988,1,0,0,1,1,,0,,,,,A,1,1,1,0,o98wpv4xravnsueejba91qxx5,1,Aileen Ellis,,,,,,,,,,,,,,,,,,,,,,,,,
4980929,1991,07/351210,1989,1,0,0,1,1,,0,,,,,A,1,1,0,1,fl:ma_ln:long-34,0,Marla M. Long,,,,,,,,,,,,,,,,,,,,,,,,,
4980930,1991,07/038958,1987,1,1,1,1,1,CROWN TEXTILE COMPANY,0,US,Blue Bell,PA,Montgomery,A,1,1,1,0,fl:jo_ln:cusimano-1,1,Joseph Cusimano,,,,,,,,,,,,,,,,,,,,,,,,,0
4980931,1991,07/401928,1989,1,0,0,1,1,,0,,,,,A,1,1,1,0,fl:ch_ln:meisels-1,1,Chaskel Meisels,,,,,,,,,,,,,,,,,,,,,,,,,
4980932,1991,07/495496,1990,1,0,0,1,1,,0,,,,,E,1,1,1,0,0959ji4zu4i1r0ju4gfuagvh0,1,Robert L. Stemples,,,,,,,,,,,,,,,,,,,,,,,,,
4980933,1991,07/375215,1989,1,1,1,1,1,THE TORO COMPANY,0,JP,Fukuoka,,,A,5,5,5,0,fl:os_ln:tsutsui-1,1,Osamu Tsutsui,fl:hi_ln:haraga-2,1,Hisato Haraga,fl:ki_ln:fujino-3,1,Kiyoshi Fujino,fl:yo_ln:uchimura-1,1,Yoshinobu Uchimura,fl:yo_ln:kawamura-7,1,Yoshiki Kawamura,,,,,,,,,,,,,0
4980934,1991,07/367998,1989,1,1,1,1,1,QUAKER PLASTIC CORPORATION,0,US,Mountville,PA,Lancaster,E,2,2,2,0,fl:do_ln:dahowski-1,1,Donald E. Dahowski,fl:st_ln:gray-36,1,"Stephen F. Gray, Sr.",,,,,,,,,,,,,,,,,,,,,,0
4980935,1991,07/395265,1989,1,1,1,1,1,"CAMBRIDGE PRODUCTS, INC.",0,US,Livonia,MI,Wayne,A,2,2,2,0,fl:ro_ln:kazanowski-1,1,Roger A. Kazanowski,jjfysmof1ih9qdwt837tvavuo,1,Brian Terski,,,,,,,,,,,,,,,,,,,,,,0
4980936,1991,07/092690,1987,1,0,0,1,1,,0,,,,,A,5,5,5,0,fl:pe_ln:frickland-2,1,Peter O. Frickland,fl:ja_ln:lea-2,1,James M. Lea,fl:pe_ln:haggerty-1,1,Peter D. Haggerty,fl:er_ln:rayl-1,1,Eric L. Rayl,fl:jo_ln:burroughs-2,1,John D. Burroughs,,,,,,,,,,,,,
4980937,1991,07/416540,1989,1,0,0,1,1,,0,,,,,A,2,2,2,0,fl:fr_ln:mason-4,1,Franklin P. Mason,fl:ch_ln:mason-2,1,Christina Mason,,,,,,,,,,,,,,,,,,,,,,
4980938,1991,07/379593,1989,1,1,1,1,1,"JOHN C. GARVIN, JR.",1,US,Huntsville,AL,Madison County,A,1,1,1,0,dpyosnzp0u9q1b73vdxdofi9f,1,Norman M. Bivins,,,,,,,,,,,,,,,,,,,,,,,,,0
4980939,1991,07/511942,1990,1,0,0,1,1,,0,,,,,A,1,1,1,0,fl:pe_ln:smith-19,1,Peter A. Smith,,,,,,,,,,,,,,,,,,,,,,,,,
4980940,1991,07/451859,1989,1,0,0,1,1,,0,,,,,A,1,1,1,0,fl:ta_ln:isshiki-5,1,Tadao Isshiki,,,,,,,,,,,,,,,,,,,,,,,,,
4980941,1991,07/427664,1989,1,1,1,1,1,"PERFECT FIT INDUSTRIES, INC.",0,US,Monroe,NC,Union,A,1,1,1,0,fl:c._ln:johnson-17,1,"C. Albert Johnson, III",,,,,,,,,,,,,,,,,,,,,,,,,0
4980942,1991,07/482564,1990,1,1,1,1,1,AD DENT INC.,0,US,Clover,SC,York,B,1,1,1,0,fl:ro_ln:spargo-2,1,"Robert M. Spargo, Sr.",,,,,,,,,,,,,,,,,,,,,,,,,0
4980943,1991,07/354392,1989,1,1,1,1,1,"STOCKWELL GROUP, INC.",0,US,Middleburg,VA,Loudoun,A,1,1,1,0,fl:jo_ln:barber-21,1,John E. Barber,,,,,,,,,,,,,,,,,,,,,,,,,0
4980944,1991,07/379392,1989,1,1,1,1,1,PYLON MANUFACTURING CORP.,0,US,Deerfield Beach,FL,Broward County,B,1,1,1,0,fl:ro_ln:longman-3,1,Rodney K. Longman,,,,,,,,,,,,,,,,,,,,,,,,,0
4980945,1991,07/441565,1989,1,1,1,1,1,WHIRLPOOL CORPORATION,0,US,Benton Harbor,MI,Berrien,A,1,1,1,0,fl:wi_ln:bewley-2,1,"Wilbur Carl Bewley, JR.",,,,,,,,,,,,,,,,,,,,,,,,,0
4980946,1991,07/430980,1989,1,1,1,1,1,FERCO INTERNATIONAL USINE DE FERRURES DE BATIMENT,0,FR,Sarrebourg,,,E,2,2,2,0,hbdhw8scyx68prgwhekdsb39d,1,Andre Verasani,fl:da_ln:vigreux-1,1,Daniel Vigreux,,,,,,,,,,,,,,,,,,,,,,0
4980947,1991,07/556427,1990,1,1,1,1,1,DEL MAR HARDWARE MANUFACTURING LIMITED,0,CA,Mississauga,ON,,E,1,1,1,0,fg9wlipphfifglwdxnn95didh,1,Don P. McQuigge,,,,,,,,,,,,,,,,,,,,,,,,,0
4980948,1991,07/457181,1989,1,1,1,1,1,"IBP, INC.",0,US,Dakota City,NE,Dakota,A,3,3,3,0,a57q9q0nx5e3sutv8bpo79eem,1,Thomas R. Trosper,fl:ro_ln:barnum-3,1,Robert Barnum,fl:ke_ln:kropf-4,1,Kenneth D. Kropf,,,,,,,,,,,,,,,,,,,0
4980949,1991,07/452882,1989,1,1,1,1,1,"TEEPAK, INC.",0,US,Westchester,IL,Cook,A,1,1,1,0,fl:th_ln:stanley-7,1,Thomas R. Stanley,,,,,,,,,,,,,,,,,,,,,,,,,0
4980950,1991,07/455184,1989,1,1,1,1,1,MASCHINENFABRIK RIETER AG,0,CH,Winterthur,,,D,3,3,3,0,fl:jo_ln:aebli-1,1,Jost Aebli,fl:da_ln:hanselmann-1,1,Daniel Hanselmann,fl:wa_ln:schlepfer-1,1,Walter Schlepfer,,,,,,,,,,,,,,,,,,,0
4980951,1991,07/498629,1990,1,1,1,1,1,SIEGFRIED PEYER AG,0,CH,Wollerau,,,D,3,3,3,0,fl:re_ln:gloor-1,1,Rene Gloor,fl:mi_ln:muller-20,1,Michael Muller,fl:al_ln:beeler-1,1,Alfred Beeler,,,,,,,,,,,,,,,,,,,0
4980952,1991,07/417896,1989,1,1,1,1,1,MASCHINENFABRIK RIETER AG,0,CH,Winterthur,,,D,2,2,2,0,fl:da_ln:erni-1,1,Daniel Erni,fl:pa_ln:staeheli-2,1,Paul Staeheli,,,,,,,,,,,,,,,,,,,,,,0
4980953,1991,07/235449,1988,1,1,1,1,1,"SUMITOMO METAL INDUSTRIES, LTD.",0,JP,Osaka,,,B,2,2,1,1,fl:ki_ln:watanabe-45,1,Kiyoharu Watanabe,fl:mi_ln:fukuhara-3,0,Minoru Fukuhara,,,,,,,,,,,,,,,,,,,,,,0
4980954,1991,07/424671,1989,1,1,1,1,1,YOSHIDA KOGYO K.K.,0,JP,Tokyo,,,A,2,2,2,0,fl:hi_ln:takabatake-2,1,Hideo Takabatake,fl:to_ln:yoshida-48,1,Tomonari Yoshida,,,,,,,,,,,,,,,,,,,,,,0
4980955,1991,07/387943,1989,1,1,1,1,1,"AMERICAN CORD & WEBBING CO., INC.",0,US,Woonsocket,RI,Providence County,A,1,1,1,0,fl:ma_ln:krauss-10,1,Mark J. Krauss,,,,,,,,,,,,,,,,,,,,,,,,,0
4980956,1991,07/416913,1989,1,1,1,1,1,THE REGENTS OF THE UNIVERSITY OF MICHIGAN,0,US,Ann Arbor,MI,Washtenaw,A,2,2,2,0,fl:th_ln:fischer-12,1,Theodore V. Fischer,fl:ar_ln:rathburn-1,1,Arthur L. Rathburn,,,,,,,,,,,,,,,,,,,,,,0
4980957,1991,07/410515,1989,1,0,0,1,1,,0,,,,,D,1,1,0,1,fl:ma_ln:sussman-1,0,Martin V. Sussman,,,,,,,,,,,,,,,,,,,,,,,,,
4980958,1991,07/363562,1989,1,1,1,1,1,AMP INCORPORATED,0,US,Harrisburg,PA,Dauphin,H,2,1,0,1,fl:sa_ln:suzuki-30,,Satoshi Suzuki,fl:mi_ln:abe-33,0,Minoru Abe,,,,,,,,,,,,,,,,,,,,,,0
4980959,1991,07/470460,1990,1,1,1,1,1,VSI CORPORATION,0,US,Chantilly,VA,Fairfax,B,1,1,1,0,fl:le_ln:czarnowski-1,1,Leonard J. Czarnowski,,,,,,,,,,,,,,,,,,,,,,,,,0
4980960,1991,07/415022,1989,1,1,1,1,1,USUI KOKUSAI SANGYO KAISHA LIMITED,0,JP,,,,B,2,1,1,0,fl:ma_ln:usui-19,,Masayoshi Usui,fl:ka_ln:takikawa-4,1,Kazunori Takikawa,,,,,,,,,,,,,,,,,,,,,,0
4980961,1991,07/379857,1989,1,1,1,1,1,CATERPILLAR INC.,0,US,Peoria,IL,Peoria County,B F,1,1,0,1,fl:ma_ln:caudill-1,0,Maurice L. Caudill,,,,,,,,,,,,,,,,,,,,,,,,,0
4980962,1991,07/495111,1990,1,1,1,1,1,WEIDMUELLER INTERFACE GMBH & CO. KG,0,DE,,,,B,1,1,1,0,fl:ul_ln:wiebe-1,1,Ulrich Wiebe,,,,,,,,,,,,,,,,,,,,,,,,,0
4980963,1991,07/501750,1990,1,0,0,1,1,,0,,,,,B,1,1,1,0,fl:wi_ln:dinse-1,1,Wilhelm Dinse,,,,,,,,,,,,,,,,,,,,,,,,,
4980964,1991,07/234271,1988,1,0,0,1,1,,0,,,,,H,1,1,1,0,fl:ja_ln:boeke-1,1,Jan Boeke,,,,,,,,,,,,,,,,,,,,,,,,,
4980965,1991,07/470808,1990,1,1,1,1,1,VACUUMSCHMELZE GMBH & CO. KG,0,DE,,,,H,3,3,3,0,fl:re_ln:dinter-1,1,Reiner Dinter,w1lmgsqdlww47hia2gx4u3kae,1,Ewald Hientzsch,ul2w71ree9klmib5d8gqp3zkz,1,Karl-Friedrich Daus,,,,,,,,,,,,,,,,,,,0
4980966,1991,07/516112,1990,1,1,1,1,1,BURR OAK TOOL & GAUGE COMPANY,0,US,Sturgis,MI,Saint Joseph,B,2,2,2,0,fl:ja_ln:milliman-2,1,James G. Milliman,fl:la_ln:franks-3,1,Lawrence A. Franks,,,,,,,,,,,,,,,,,,,,,,0
4980967,1991,07/531371,1990,1,1,1,1,1,YAZAKI CORPORATION,0,JP,Tokyo,,,H,3,3,1,2,fl:ma_ln:ishida-53,0,Masahiko Ishida,fl:no_ln:yamakawa-7,0,Nobuaki Yamakawa,fl:ma_ln:shiida-1,1,Masahiro Shiida,,,,,,,,,,,,,,,,,,,0
4980968,1991,07/387690,1989,1,1,1,1,1,"OPTI PATENT-, FORSCHUNGS- UND FABRIKATIONS-AG",0,CH,Glarus,,,A B,4,4,4,0,gtn8nhbs7mox2nf40n4k7yc6j,1,Reiner Hilterhaus,fl:re_ln:damaschke-1,1,Reinhard Damaschke,fl:jo_ln:geiger-12,1,Jorg Geiger,fl:ku_ln:scheid-1,1,Kurt Scheid,,,,,,,,,,,,,,,,0
4980969,1991,07/366528,1989,1,0,0,1,1,,0,,,,,B,1,0,0,0,fl:ma_ln:marchesini-2,,Massimo Marchesini,,,,,,,,,,,,,,,,,,,,,,,,,
4980970,1991,07/523415,1990,1,1,1,1,1,FUJITSU LIMITED,0,JP,Yokohama,,,H,3,3,3,0,fl:ke_ln:uchida-16,1,Kenji Uchida,fl:ki_ln:ohkubo-4,1,Kiyomi OHKUBO,fl:ma_ln:matumoto-1,1,Makoto Matumoto,,,,,,,,,,,,,,,,,,,0
4980971,1991,07/456930,1989,1,1,1,1,1,AT&T BELL LABORATORIES,0,US,New Providence,NJ,Union,B H,2,2,2,0,wwmds1uqx9e24l759pae68p8f,1,Michael K. Bartschat,fl:jo_ln:kovalchick-1,1,Joseph S. Kovalchick,,,,,,,,,,,,,,,,,,,,,,0
4980972,1991,07/405715,1989,1,1,1,1,1,WESTINGHOUSE ELECTRIC CORP.,0,US,Pittsburgh,PA,Allegheny,H,2,2,2,0,fl:sh_ln:singh-40,1,Sharad Singh,fl:do_ln:hackworth-1,1,Donald T. Hackworth,,,,,,,,,,,,,,,,,,,,,,0
4980973,1991,07/486210,1990,1,0,0,1,1,,0,,,,,B,2,2,1,1,fl:ch_ln:lee-1434,1,Chin-Piao Lee,fl:ed_ln:lee-31,0,Edward Lee,,,,,,,,,,,,,,,,,,,,,,
4980974,1991,07/350756,1989,1,0,0,1,1,,0,,,,,B,1,1,1,0,fl:al_ln:radcliffe-3,1,Allan F. Radcliffe,,,,,,,,,,,,,,,,,,,,,,,,,
4980975,1991,07/382745,1989,1,1,1,1,1,"BULLDOG TOOLS, INC.",0,GB,Longridge,,,B,1,0,0,0,fl:ja_ln:hodson-4,,James W. Hodson,,,,,,,,,,,,,,,,,,,,,,,,,0
4980976,1991,07/438522,1989,1,1,1,1,1,C. & E. FEIN GMBH,0,DE,,,,B,2,2,2,0,fl:kl_ln:junginger-1,1,Klaus M. Junginger,fl:ge_ln:harsch-1,1,Georg Harsch,,,,,,,,,,,,,,,,,,,,,,0
4980977,1991,07/462923,1990,1,1,1,1,1,THE BOEING COMPANY,0,US,Seattle,WA,King,B,3,3,3,0,fl:ba_ln:matin-1,1,Barry D. Matin,j6iypyohd7f2tn3xukkdfnhlp,1,Ellwood R. Pelton,fl:ge_ln:trepus-1,1,"George E. Trepus, Jr.",,,,,,,,,,,,,,,,,,,0
4980978,1991,07/283488,1988,1,1,1,1,1,"INSTITUT PROBLEM MEKHANIKI AKADEMI, ETC.",0,RU,Moskovskiy,,,F,8,8,6,2,s88a9klbx8n1lvfklckf8sq8m,1,Sergei F. Demidov,fl:va_ln:molochnikov-1,1,Valery Molochnikov,fl:vl_ln:babin-2,1,Vladimir V. Babin,5crg7gtag38ut4843a5otbp4w,1,Anatoly N. Mangush,x1qytqt8elc6t0zavp0vrcsgj,1,Sergei P. Skladanovsky,v77p7ucbls8gchxizuhnnd0b8,1,Gennady N. Smykov,fl:ju_ln:martynov-1,0,Jury V. Martynov,sxu1zb7qumrkalxzdbfma3qng,0,Elena A. Rudakova,,,,0
4980979,1991,07/243742,1988,1,1,1,1,1,BELOIT CORPORATION,0,US,Beloit,WI,Rock,F,1,1,1,0,fl:gr_ln:wedel-1,1,Gregory L. Wedel,,,,,,,,,,,,,,,,,,,,,,,,,0
4980980,1991,07/348496,1989,1,0,0,1,1,,0,,,,,E,5,5,5,0,d5fcztu02verkqb4fdjn553sr,1,Mikhail I. Schadov,lte87h0uyv8z4s4hhogioaad2,1,Viktor M. Zhdamirov,d0x9r5ka3gds5e6kss6x0tggd,1,Konstantin E. Vinitsky,hgt5snzli6t009bqs2f2yr7nr,1,Evgeny E. Goldbukht,fl:al_ln:berman-11,1,Alexandr V. Berman,,,,,,,,,,,,,
4980981,1991,07/046880,1987,1,1,1,1,1,AUSTRALIAN MUD COMPANY LTD.,0,AU,Perth,,,D,1,0,0,0,fl:th_ln:naidoo-2,,Tholsee Naidoo,,,,,,,,,,,,,,,,,,,,,,,,,0
4980982,1991,06/902144,1986,1,0,0,1,1,,0,,,,,A G,2,2,2,0,fke6uo9d8qcij3ckktsrma3vp,1,James F. Verdon,krx50zi7iande5juzzpmujf8y,1,Daniel Firestein,,,,,,,,,,,,,,,,,,,,,,
4980983,1991,07/361848,1989,1,0,0,1,1,,0,,,,,A,1,1,0,1,assyjxivretxiu8qnm2pmtjiu,0,Jean-Marie Champley,,,,,,,,,,,,,,,,,,,,,,,,,
4980984,1991,07/404111,1989,1,1,1,1,1,"TRAFFIC DEVICES, INC.",0,US,San Clemente,CA,Orange,G,2,2,2,0,fl:ja_ln:kulp-1,1,Jack H. Kulp,fl:jo_ln:mckenney-3,1,John D. McKenney,,,,,,,,,,,,,,,,,,,,,,0
4980985,1991,07/413124,1989,1,1,1,1,1,"BROWNING INTERNATIONAL, SOCIETE ANONYME",0,BE,Herstal,,,F,1,1,1,0,fl:th_ln:dumortier-2,1,Thierry Dumortier,,,,,,,,,,,,,,,,,,,,,,,,,0
4980986,1991,07/158341,1988,1,0,0,1,1,,0,,,,,A,1,1,1,0,fl:de_ln:harper-5,1,Dennis Harper,,,,,,,,,,,,,,,,,,,,,,,,,
4980987,1991,07/412737,1989,1,0,0,1,1,,0,,,,,A,1,1,1,0,fl:ja_ln:ramsey-6,1,James W. Ramsey,,,,,,,,,,,,,,,,,,,,,,,,,
4980988,1991,07/364998,1989,1,0,0,1,1,,0,,,,,A,1,1,1,0,fl:pe_ln:whitman-1,1,Peter J. Whitman,,,,,,,,,,,,,,,,,,,,,,,,,
4980989,1991,07/465491,1990,1,0,0,1,1,,0,,,,,A,1,1,1,0,fl:gr_ln:davis-17,1,Gregory D. Davis,,,,,,,,,,,,,,,,,,,,,,,,,
4980990,1991,07/451143,1989,1,0,0,1,1,,0,,,,,A,1,1,1,0,8pkfr9jkjs1qwkha3og4ik2xx,1,Rex H. Hiday,,,,,,,,,,,,,,,,,,,,,,,,,
4980991,1991,06/931215,1986,1,1,1,1,1,THE CROWELL CORPORATION,0,US,Newport,DE,New Castle,A,2,2,2,0,fl:je_ln:kipnees-1,1,Jerome J. Kipnees,fl:le_ln:raszewski-1,1,Lewis R. Raszewski,,,,,,,,,,,,,,,,,,,,,,0
4980992,1991,07/421544,1989,1,1,1,1,1,OVERHEAD DOOR CORPORATION,0,US,Dallas,TX,Dallas County,E,3,2,2,0,fl:wi_ln:liles-1,1,"William S. Liles, Jr.",fl:le_ln:hewitt-1,1,Lew V. Hewitt,fl:da_ln:hewitt-3,,David Paul Hewitt,,,,,,,,,,,,,,,,,,,0
4980993,1991,07/407500,1989,1,1,1,1,1,SEIKO EPSON CORPORATION,0,JP,Tokyo,,,B,1,1,1,0,fl:hi_ln:umezaki-3,1,Hideaki Umezaki,,,,,,,,,,,,,,,,,,,,,,,,,0
4980994,1991,07/378239,1989,1,1,1,1,1,ROBERT BOSCH GMBH,0,DE,Stuttgart,,,B,2,2,2,0,fl:wi_ln:helm-1,1,Winfried Helm,fl:ma_ln:stabler-1,1,Manfred Stabler,,,,,,,,,,,,,,,,,,,,,,0
4980995,1991,07/243228,1988,1,0,0,1,1,,0,,,,,B,1,1,1,0,fl:c._ln:smith-16,1,C. R. Smith,,,,,,,,,,,,,,,,,,,,,,,,,
4980996,1991,07/206215,1988,1,1,1,1,1,GEHRING TECHNOLOGIES GMBH,0,DE,Esslingen am Neckar,,,B,2,2,2,0,fl:ul_ln:klink-1,1,Ulrich Klink,fl:ge_ln:sandhof-1,1,Gerhard Sandhof,,,,,,,,,,,,,,,,,,,,,,0
4980997,1991,07/433749,1989,1,1,1,1,1,"A-1 ALL WEATHER ROOFING, INC.",0,US,Portland,OR,Multnomah County,E,1,1,1,0,fl:ch_ln:tawzer-1,1,Charles Tawzer,,,,,,,,,,,,,,,,,,,,,,,,,0
4980998,1991,07/294245,1989,1,1,1,1,1,AMSTORE CORPORATION,0,US,Muskegon,MI,Muskegon County,G,2,1,1,0,fl:do_ln:amstutz-1,1,Douglas D. Amstutz,fl:ad_ln:weiss-4,,Adrienne Weiss,,,,,,,,,,,,,,,,,,,,,,0
4980999,1991,07/224744,1988,1,0,0,1,1,,0,,,,,E,1,1,1,0,fl:ro_ln:terenzoni-1,1,Robert Terenzoni,,,,,,,,,,,,,,,,,,,,,,,,,
4981000,1991,07/451215,1989,1,1,1,1,1,A. B. CHANCE COMPANY,0,US,Centralia,MO,Boone,E,2,2,2,0,fl:da_ln:hamilton-4,1,Daniel V. Hamilton,fl:j._ln:odom-1,1,J. Thomas Odom,,,,,,,,,,,,,,,,,,,,,,0
4981001,1991,07/450526,1989,1,1,1,1,1,YOSHIDA KOGYO K.K.,0,JP,Tokyo,,,E,1,1,1,0,fl:ko_ln:furuminato-1,1,Kozo Furuminato,,,,,,,,,,,,,,,,,,,,,,,,,0
4981002,1991,07/324759,1989,1,1,1,1,1,TERMOFROST AB,0,SE,Sollentuna,,,E,1,1,1,0,a607z7y311116ls3imzft5k6o,1,Lars Cederholm,,,,,,,,,,,,,,,,,,,,,,,,,0
4981003,1991,07/384312,1989,1,1,1,1,1,BEAVER PLASTICS LTD.,0,CA,Edmonton,AB,,E,1,1,1,0,fl:gr_ln:mccarthy-7,1,Grant McCarthy,,,,,,,,,,,,,,,,,,,,,,,,,0
4981004,1991,07/373515,1989,1,0,0,1,1,,0,,,,,E,1,1,1,0,fl:ha_ln:weber-19,1,Hans Weber,,,,,,,,,,,,,,,,,,,,,,,,,
4981005,1991,07/405332,1989,1,0,0,1,1,,0,,,,,E,1,1,1,0,fl:he_ln:mcginnis-1,1,Henry J. McGinnis,,,,,,,,,,,,,,,,,,,,,,,,,
4981006,1991,07/368649,1989,1,1,1,1,1,SASIB S.P.A.,0,IT,Bologna,,,B,2,2,2,0,fl:sa_ln:caenazzo-1,1,Santo Caenazzo,fl:sa_ln:corticelli-1,1,Sandro Corticelli,,,,,,,,,,,,,,,,,,,,,,0
4981007,1991,07/436732,1989,1,1,1,1,1,"KYOKUJITSU CO., LTD.",0,JP,Tokyo,,,B,6,5,5,0,fl:yo_ln:shima-7,1,Yoshisuke Shima,fl:ku_ln:shibazaki-1,1,Kunihiro Shibazaki,fl:yo_ln:konishi-12,,Yoshiyuki Konishi,fl:to_ln:ryuno-1,1,Toshiro Ryuno,fl:mi_ln:fujita-11,1,Mitsunobu Fujita,fl:hi_ln:yoshida-24,1,Hisaji Yoshida,,,,,,,,,,1
4981008,1991,07/357378,1989,1,1,1,1,1,"RESTAURANT TECHNOLOGY, INC.",0,US,Oak Brook,IL,DuPage,B,3,3,3,0,fl:ed_ln:ott-4,1,Edward L. Ott,fl:ja_ln:zavodsky-1,1,James Zavodsky,ci246ct8a4a7lxgx14a2bohy0,1,Carl D. Deshich,,,,,,,,,,,,,,,,,,,0
4981009,1991,07/176827,1988,1,1,1,1,1,W. R. GRACE & CO.-CONN.,0,US,Duncan,SC,Spartanburg,B,1,1,1,0,fl:gi_ln:gianelli-1,1,Gian C. Gianelli,,,,,,,,,,,,,,,,,,,,,,,,,0
4981010,1991,07/401627,1989,1,0,0,1,1,,0,,,,,A,2,2,2,0,w943kwmvbheionzna16pletih,1,Frank Orza,fl:ma_ln:hughes-32,1,Mary Virginia Hughes,,,,,,,,,,,,,,,,,,,,,,
4981011,1991,07/360453,1989,1,0,0,1,1,,0,,,,,A,1,1,1,0,fl:in_ln:olejak-1,1,Ingo Olejak,,,,,,,,,,,,,,,,,,,,,,,,,
4981012,1991,07/211049,1988,1,1,1,1,1,"WEDGER, INC.",0,US,Dallas,TX,Dallas County,A,1,1,1,0,fl:mo_ln:claborn-1,1,Morris W. Claborn,,,,,,,,,,,,,,,,,,,,,,,,,0
4981013,1991,07/396308,1989,1,0,0,1,1,,0,,,,,A,1,1,1,0,fl:ch_ln:underwood-10,1,Chester E. Underwood,,,,,,,,,,,,,,,,,,,,,,,,,
4981014,1991,07/189720,1988,1,0,0,1,1,,0,,,,,F,1,1,1,0,fl:pa_ln:gallagher-3,1,Paul H. Gallagher,,,,,,,,,,,,,,,,,,,,,,,,,
4981015,1991,07/259454,1988,1,0,0,1,1,,0,,,,,F,1,1,0,1,fl:ch_ln:simpson-11,0,Charles E. Simpson,,,,,,,,,,,,,,,,,,,,,,,,,
4981016,1991,07/440635,1989,1,1,1,1,1,GENERAL MOTORS CORPORATION,0,US,Detroit,MI,Wayne,B F,1,0,0,0,fl:jo_ln:coleman-37,,John R. Coleman,,,,,,,,,,,,,,,,,,,,,,,,,0
4981017,1991,07/415785,1989,1,1,1,1,1,ISUZU MOTORS LIMITED,0,JP,Tokyo,,,F,2,2,2,0,fl:sh_ln:hara-47,1,Shinji Hara,fl:yo_ln:koizumi-11,1,Yoshihisa Koizumi,,,,,,,,,,,,,,,,,,,,,,0
4981018,1991,07/354015,1989,1,1,1,1,1,SUNDSTRAND CORPORATION,0,US,Rockford,IL,Winnebago County,F,2,2,2,0,fl:an_ln:jones-29,1,Anthony C. Jones,fl:co_ln:rodgers-2,1,Colin Rodgers,,,,,,,,,,,,,,,,,,,,,,0
4981019,1991,07/436781,1989,1,0,0,1,1,,0,,,,,F,2,2,1,1,fl:ca_ln:hicks-4,0,Carole L. Hicks,fl:je_ln:cudd-1,1,Jeffrey S. Cudd,,,,,,,,,,,,,,,,,,,,,,
4981020,1991,07/474925,1990,1,0,0,1,1,,0,,,,,F,1,1,1,0,fl:ca_ln:scuderi-1,1,Carmelo J. Scuderi,,,,,,,,,,,,,,,,,,,,,,,,,
4981021,1991,07/356681,1989,1,1,1,1,1,GEOPHYSICAL ENGINEERING COMPANY,0,US,Seattle,WA,King,F,1,1,1,0,fl:ga_ln:assaf-1,1,Gad Assaf,,,,,,,,,,,,,,,,,,,,,,,,,0
4981022,1991,07/404825,1989,1,1,1,1,1,"AMERICAN CYCLE INDUSTRIES, INC.",0,US,Santa Fe Springs,CA,Los Angeles,F,1,1,1,0,fl:da_ln:snyder-14,1,Daniel Snyder,,,,,,,,,,,,,,,,,,,,,,,,,0
4981023,1991,07/378044,1989,1,1,1,1,1,"INNOVATIVE PRODUCTS, INC.",0,US,Lombard,IL,DuPage,F,2,1,1,0,fl:c._ln:krishnakumar-1,,C. K. Krishnakumar,fl:cl_ln:schafer-3,1,Clyde K. Schafer,,,,,,,,,,,,,,,,,,,,,,0
4981024,1991,07/306827,1989,1,1,1,1,1,"BELCO EQUIPMENT, INC.",0,US,معلمی نژاد,CA,Santa Clara,D,1,1,1,0,fl:pa_ln:beldham-1,1,Paul M. Beldham,,,,,,,,,,,,,,,,,,,,,,,,,0
4981025,1991,07/441845,1989,1,1,1,1,1,BRAZZOLI S.P.A.,0,IT,,,,D,1,0,0,0,af0fn1wn40ix224wvlgj4bmrw,,Gaimpietro Brazzoli,,,,,,,,,,,,,,,,,,,,,,,,,0
4981026,1991,07/331620,1989,1,1,1,1,1,KOKUSAN KINZOKU KOGYO KABUSHIKI KAISHA,0,JP,Tokyo,,,B,4,4,4,0,fl:hi_ln:sakuno-1,1,Hideaki Sakuno,fl:mi_ln:masaki-4,1,Mikio Masaki,fl:to_ln:kobayashi-61,1,Toshikazu Kobayashi,fl:hi_ln:sato-96,1,Hidekazu Sato,,,,,,,,,,,,,,,,0
4981027,1991,07/337906,1989,1,1,1,1,1,"EB METAL INDUSTRIES, INC.",0,US,Hague,NY,Town of Hague,E,2,2,1,1,fl:ev_ln:friedman-1,0,Evelyn Friedman,fl:wi_ln:carswell-1,1,William R. Carswell,,,,,,,,,,,,,,,,,,,,,,0
4981028,1991,07/375922,1989,1,1,1,1,1,VDEH-BETRIEBSFORSCHUNGSINSTITUT GMBH,0,DE,Düsseldorf,,,B,3,3,3,0,fl:be_ln:berger-6,1,Bernd Berger,fl:ge_ln:mucke-2,1,Gert Mucke,fl:eb_ln:neuschutz-1,1,Eberhart Neuschutz,,,,,,,,,,,,,,,,,,,0
4981029,1991,07/457230,1989,1,1,1,1,1,CARRIER CORPORATION,0,US,Syracuse,NY,Onondaga,B,1,1,0,1,fl:ar_ln:evans-13,0,Arthur Evans,,,,,,,,,,,,,,,,,,,,,,,,,0
4981030,1991,07/446200,1989,1,0,0,1,1,,0,,,,,B,2,2,2,0,fl:al_ln:caporusso-1,1,Alessandro Caporusso,fl:ma_ln:caporusso-1,1,Mario Caporusso,,,,,,,,,,,,,,,,,,,,,,
4981031,1991,07/413607,1989,1,1,1,1,1,L. SCHULER GMBH,0,DE,,,,B,3,2,2,0,fl:fr_ln:schneider-27,,Franz Schneider,fl:ru_ln:brandstetter-1,1,Rudi Brandstetter,fl:wo_ln:michael-1,1,Wolfgang Michael,,,,,,,,,,,,,,,,,,,0
4981032,1991,07/456358,1989,1,1,1,1,1,BLEIWERK GOSLAR GMBH & CO. KG BESSERER & ERNST,0,DE,Goslar,,,B H,1,1,1,0,fl:ch_ln:chen-833,1,Ching-Jen Chen,,,,,,,,,,,,,,,,,,,,,,,,,0
4981033,1991,07/519045,1990,1,0,0,1,1,,0,,,,,G,1,1,0,1,fl:li_ln:yang-248,0,Lien-Chuan Yang,,,,,,,,,,,,,,,,,,,,,,,,,
4981034,1991,07/517243,1990,1,1,1,1,1,MTS SYSTEMS CORPORATION,0,US,Eden Prairie,MN,Hennepin County,G,1,1,1,0,fl:st_ln:haeg-2,1,Steven R. Haeg,,,,,,,,,,,,,,,,,,,,,,,,,0
4981035,1991,07/474429,1990,1,1,1,1,1,SIEMENS AUTOMOTIVE L.P.,0,US,Troy,MI,Oakland,G,1,0,0,0,fl:br_ln:hall-34,,Bryan Hall,,,,,,,,,,,,,,,,,,,,,,,,,0
4981036,1991,07/372987,1989,1,1,1,1,1,"ANADRILL, INC.",0,US,Sugar Land,TX,Fort Bend,E,2,2,2,0,fl:da_ln:curry-15,1,David Curry,fl:mi_ln:sheppard-6,1,Michael Charles Sheppard,,,,,,,,,,,,,,,,,,,,,,0
4981037,1991,06/868317,1986,1,1,1,1,1,"BAROID TECHNOLOGY, INC.",0,US,Houston,TX,Harris County,E,3,2,2,0,fl:ph_ln:holbrook-1,1,Phil Holbrook,fl:ho_ln:robertson-2,1,Homer A. Robertson,fl:mi_ln:hauck-2,,Michael Hauck,,,,,,,,,,,,,,,,,,,0
4981038,1991,07/514676,1990,1,1,1,1,1,ROSEMOUNT INC.,0,GB,,,,G,5,5,4,1,fl:ma_ln:torres-12,0,Mark J. Torres,fl:me_ln:white-1,1,Melvyn S. White,fl:ke_ln:rendle-1,1,Ken Rendle,xd6h4bqt1j5nat6nzdgd1p3w0,1,Mike Lamdin,fl:ja_ln:johnston-20,1,James S. Johnston,,,,,,,,,,,,,0
4981039,1991,07/375671,1989,1,1,1,1,1,"TOYODA GOSEI CO., LTD.",0,JP,Kita Nagoya,,,G H,4,4,3,1,fl:ch_ln:hayashi-7,0,Chikahisa Hayashi,fl:ma_ln:kawai-5,1,Makoto Kawai,fl:to_ln:takahashi-41,1,Toshinori Takahashi,fl:mi_ln:kikuta-3,1,Mitsuhiro Kikuta,,,,,,,,,,,,,,,,0
4981040,1991,07/440990,1989,1,0,0,1,1,,0,,,,,G,1,1,1,0,fl:ja_ln:lin-61,1,Jack Lin,,,,,,,,,,,,,,,,,,,,,,,,,
4981041,1991,07/895809,1986,1,0,0,1,1,,0,,,,,G,1,1,1,0,fl:jo_ln:merkle-5,1,John H. Merkle,,,,,,,,,,,,,,,,,,,,,,,,,
4981042,1991,07/252748,1988,1,0,0,1,1,,0,,,,,G,1,1,1,0,fl:go_ln:reeves-2,1,Goodwyn George Reeves,,,,,,,,,,,,,,,,,,,,,,,,,
4981043,1991,07/322463,1989,1,1,1,1,1,DENSHI SEIKI KOGYO KABUSHIKI KAISHA,0,JP,Osaka,,,G,1,1,1,0,fl:hi_ln:okumura-26,1,Hiromitu Okumura,,,,,,,,,,,,,,,,,,,,,,,,,0
4981044,1991,07/365973,1989,1,1,1,1,1,SIEMENS AKTIENGESELLSCHAFT,0,DE,Munich,,,G,3,3,3,0,fl:he_ln:adams-6,1,Helmar Adams,fl:pe_ln:hertel-1,1,Peter Hertel,fl:he_ln:jacob-6,1,Heinz-Juergen Jacob,,,,,,,,,,,,,,,,,,,0
4981045,1991,07/393060,1989,1,1,1,1,1,THE UNIVERSITY OF TORONTO INNOVATIONS FOUNDATION,0,CA,Toronto,ON,,G,1,1,1,0,fl:no_ln:mountford-1,1,Norman D. G. Mountford,,,,,,,,,,,,,,,,,,,,,,,,,0
4981046,1991,07/255112,1988,1,1,1,1,1,PHARMACOLOGY & TOXICOLOGY RESEARCH LAB.,0,US,Lexington,KY,Fayette,F,5,4,3,1,fl:lo_ln:lawrence-6,,Lowell J. Lawrence,fl:ab_ln:kesterson-1,0,Abbe L. Kesterson,fl:st_ln:jackson-22,1,Steven B. Jackson,fl:lu_ln:ruzo-1,1,Luis O. Ruzo,fl:te_ln:johnson-20,1,Terry L. Johnson,,,,,,,,,,,,,0
4981047,1991,07/443472,1989,1,1,1,1,1,KABUSHIKI KAISHA TOSHIBA,0,JP,Kobe,,,G,4,4,3,1,fl:ri_ln:denda-1,1,Rinta Denda,fl:ma_ln:nishimoto-18,1,Masaharu Nishimoto,fl:hi_ln:kasa-1,1,Hidetomo Kasa,fl:ka_ln:doi-1,0,Kazuyuki Doi,,,,,,,,,,,,,,,,0
4981048,1991,07/257575,1988,1,1,1,1,1,"FUJI KIKO CO., LTD.",0,JP,Yokohama,,,B,2,2,2,0,fl:sa_ln:kobayashi-18,1,Satoshi Kobayashi,fl:ko_ln:kato-26,1,Koji Kato,,,,,,,,,,,,,,,,,,,,,,1
4981049,1991,07/462554,1990,1,1,1,1,1,TRW INC.,0,US,Lyndhurst,OH,Cuyahoga,B F,2,2,2,0,fl:fr_ln:venable-2,1,Frederick D. Venable,fl:be_ln:hudgens-1,1,Bernard C. Hudgens,,,,,,,,,,,,,,,,,,,,,,0
4981050,1991,07/199467,1988,1,0,0,1,1,,0,,,,,F,1,1,1,0,fl:cs_ln:kurtossy-1,1,Csaba G. Kurtossy,,,,,,,,,,,,,,,,,,,,,,,,,
4981051,1991,07/283275,1988,1,1,1,1,1,LENINGRADSKY INSTITUT INFORMATIKI I AVTOMATIZATSII,0,PH,Las Piñas,,,F,6,6,5,1,9r1lzyjn6h1t990o54k49w04m,1,Arnold E. Bor-Ramensky,fl:va_ln:kuznetsov-4,1,Valery N. Kuznetsov,sovjknn8ihdi38deq8rxpdjga,1,Nikolai I. Kukin,a8z01zp9s7rugnhpyklj9db1o,0,Svetlana V. Kudryashova,fl:vl_ln:ivanov-9,1,Vladimir N. Ivanov,89cxednuy7tizsrp2jtuhkn21,1,Vladimir K. Skalnov,,,,,,,,,,0
4981052,1991,07/328080,1989,1,1,1,1,1,ZAHNRADFABRIK FRIEDRICHSHAFEN AG,0,DE,Friedrichshafen,,,B,1,1,1,0,fl:ge_ln:gierer-1,1,Georg Gierer,,,,,,,,,,,,,,,,,,,,,,,,,0
4981053,1991,07/289050,1988,1,1,1,1,1,"NISSAN MOTOR CO., LTD.",0,JP,Yokohama,,,B,1,1,1,0,fl:hi_ln:yamaguchi-85,1,Hiroshi Yamaguchi,,,,,,,,,,,,,,,,,,,,,,,,,0
4981054,1991,07/449545,1989,1,0,0,1,1,,0,,,,,H,1,1,1,0,fl:ji_ln:stepan-1,1,Jiri Stepan,,,,,,,,,,,,,,,,,,,,,,,,,
4981055,1991,07/330804,1989,1,1,1,1,1,TRI TOOL INC.,0,US,Rancho Cordova,CA,Sacramento,B,2,2,2,0,fl:je_ln:vanderpol-1,1,Jerald VanderPol,fl:wi_ln:sandford-1,1,William E. Sandford,,,,,,,,,,,,,,,,,,,,,,0
4981056,1991,07/492084,1990,1,1,1,1,1,"HARDINGE BROTHERS, INC.",0,US,Elmira,NY,Chemung,B,3,3,3,0,fl:iv_ln:brown-3,1,Ivan R. Brown,fl:br_ln:eaton-3,1,Brian M. Eaton,fl:ro_ln:carlyle-1,1,Robert B. Carlyle,,,,,,,,,,,,,,,,,,,0
4981057,1991,07/424057,1989,1,1,1,1,1,FRIED. KRUPP GESELLSCHAFT MIT BESCHRANKTER HAFTUNG,0,DE,Essen,,,B,2,2,2,0,fl:ra_ln:vonhaas-1,1,Rainer von Haas,fl:gu_ln:ruther-1,1,Gunter Ruther,,,,,,,,,,,,,,,,,,,,,,0