patent_number,grant_year,application_number,application_year,d_inventor,d_assignee,d_location,d_application,d_ipc,assignee,assignee_ind,country,city,state,county,ipc_section,team_size,inventors,men_inventors,women_inventors,inventor_id1,male_flag1,inventor_name1,inventor_id2,male_flag2,inventor_name2,inventor_id3,male_flag3,inventor_name3,inventor_id4,male_flag4,inventor_name4,inventor_id5,male_flag5,inventor_name5,inventor_id6,male_flag6,inventor_name6,inventor_id7,male_flag7,inventor_name7,inventor_id8,male_flag8,inventor_name8,inventor_id9,male_flag9,inventor_name9,assignee_sequence
5175886,1993,07/739242,1991,1,0,0,1,1,,0,,,,,A,1,1,0,1,fl:yo_ln:suk-3,0,Young J. Suk,,,,,,,,,,,,,,,,,,,,,,,,,
5175887,1993,07/811311,1991,1,0,0,1,1,,0,,,,,A,1,1,1,0,fl:da_ln:kim-149,1,Daniel Kim,,,,,,,,,,,,,,,,,,,,,,,,,
5175888,1993,07/911763,1992,1,0,0,1,1,,0,,,,,A,1,1,0,1,fl:ha_ln:clark-14,0,Harold E. Clark,,,,,,,,,,,,,,,,,,,,,,,,,
5175889,1993,07/863337,1992,1,1,1,1,1,"RIDDELL, INC.",0,US,Chicago,IL,Cook County,A,1,1,1,0,fl:ra_ln:infusino-1,1,Ralph Infusino,,,,,,,,,,,,,,,,,,,,,,,,,0
5175890,1993,07/698451,1991,1,0,0,1,1,,0,,,,,E,1,1,1,0,fl:so_ln:ruth-1,1,Solomon J. Ruth,,,,,,,,,,,,,,,,,,,,,,,,,
5175891,1993,07/566040,1990,1,1,1,1,1,"SUGATSUNE INDUSTRIAL CO., LTD.",0,JP,Tokyo,,,A E,2,1,1,0,fl:ka_ln:ohshima-8,1,Kazuyoshi Ohshima,fl:yo_ln:nakayama-19,,Yojiro Nakayama,,,,,,,,,,,,,,,,,,,,,,0
5175892,1993,07/507462,1990,1,1,1,1,1,"BAKER INDUSTRIES, INC.",0,US,Orlando,FL,Orange,E,1,0,0,0,fl:da_ln:shaw-40,,Daniel C. Shaw,,,,,,,,,,,,,,,,,,,,,,,,,0
5175893,1993,07/699708,1991,1,0,0,1,1,,0,,,,,E,1,1,1,0,jh51kraeufd8gdzokany6vsnu,1,Raul A. Navarrete,,,,,,,,,,,,,,,,,,,,,,,,,
5175894,1993,07/830306,1992,1,1,1,1,1,AUCERA TECHNOLOGY CORP.,0,TW,Taipei,,,E F,1,1,1,0,fl:ju_ln:chen-10,1,Jui-Hsiang Chen,,,,,,,,,,,,,,,,,,,,,,,,,0
5175895,1993,07/515861,1990,1,0,0,1,1,,0,,,,,E,2,2,2,0,fl:je_ln:fike-2,1,Jeffrey R. Fike,fl:jo_ln:fernstrum-1,1,"John A. Fernstrum, Jr.",,,,,,,,,,,,,,,,,,,,,,
5175896,1993,07/721072,1991,1,0,0,1,1,,0,,,,,A,1,1,1,0,fl:am_ln:zamir-2,1,Amos Zamir,,,,,,,,,,,,,,,,,,,,,,,,,
5175897,1993,07/899320,1992,1,0,0,1,1,,0,,,,,A,1,1,1,0,fl:jo_ln:marra-8,1,John J. Marra,,,,,,,,,,,,,,,,,,,,,,,,,
5175898,1993,06/810081,1985,1,1,1,1,1,ADVANCED SLEEP PRODUCTS,0,US,Carson,CA,Los Angeles,A,2,2,1,1,fl:jo_ln:johenning-1,1,John B. Johenning,fl:ch_ln:hall-11,0,Charles P. Hall,,,,,,,,,,,,,,,,,,,,,,0
5175899,1993,07/881201,1992,1,0,0,1,1,,0,,,,,A,1,1,1,0,fl:kw_ln:lou-1,1,Kwong-Li Lou,,,,,,,,,,,,,,,,,,,,,,,,,
5175900,1993,07/719960,1991,1,1,1,1,1,"AREWAY, INC.",0,US,Brooklyn,OH,Cuyahoga,A B,1,1,1,0,fl:jo_ln:hadgis-1,1,John S. Hadgis,,,,,,,,,,,,,,,,,,,,,,,,,0
5175901,1993,07/694357,1991,1,0,0,1,1,,0,,,,,A,1,1,1,0,fl:ga_ln:rabinowitz-1,1,Gary Rabinowitz,,,,,,,,,,,,,,,,,,,,,,,,,
5175902,1993,07/804683,1991,1,0,0,1,1,,0,,,,,A,1,1,1,0,fl:so_ln:samuelsson-1,1,Soren Samuelsson,,,,,,,,,,,,,,,,,,,,,,,,,
5175903,1993,07/419225,1989,1,1,1,1,1,TRICO PRODUCTS CORPORATION,0,US,Buffalo,NY,Erie,B,1,0,0,0,fl:ma_ln:curtis-19,,Martyn Curtis,,,,,,,,,,,,,,,,,,,,,,,,,0
5175904,1993,07/765728,1991,1,1,1,1,1,VDM S.R.L.,0,IT,Arese,,,A,1,1,1,0,fl:el_ln:pagani-1,1,Elio Pagani,,,,,,,,,,,,,,,,,,,,,,,,,0
5175905,1993,07/732784,1991,1,1,1,1,1,"ALANDALE INDUSTRIES, INC.",0,US,Troy,NC,Montgomery,D,1,1,1,0,fl:al_ln:gutschmit-1,1,Alan Gutschmit,,,,,,,,,,,,,,,,,,,,,,,,,0
5175906,1993,07/531945,1990,1,1,1,1,1,"AGRICON, INC.",0,US,Mayville,ND,Traill,B,1,1,1,0,fl:la_ln:holter-1,1,Larry Holter,,,,,,,,,,,,,,,,,,,,,,,,,0
5175907,1993,07/703262,1991,1,1,1,1,1,HEINRICH BAUMGARTEN KG SPEZIALFABRIK FUER BESCHLAGTEILE,0,DE,Neunkirchen,,,A,1,1,1,0,fl:ge_ln:baumgarten-1,1,Gerd-Diethard Baumgarten,,,,,,,,,,,,,,,,,,,,,,,,,0
5175908,1993,07/809296,1991,1,1,1,1,1,GRASS GMBH,0,AT,Lustenau,,,E,1,1,1,0,fl:ge_ln:domenig-1,1,Georg Domenig,,,,,,,,,,,,,,,,,,,,,,,,,0
5175909,1993,07/738382,1991,1,1,0,1,1,HERGETH HOLLINGSWORTH GMBH,0,,,,,D,1,1,1,0,fl:ak_ln:pinto-1,1,Akiva Pinto,,,,,,,,,,,,,,,,,,,,,,,,,0
5175910,1993,07/877217,1992,1,1,1,1,1,YOSHIDA KOGYO K.K.,0,JP,Tokyo,,,A,1,1,1,0,fl:hi_ln:mizuno-29,1,Hiroshi Mizuno,,,,,,,,,,,,,,,,,,,,,,,,,0
5175911,1993,07/792383,1991,1,0,0,1,1,,0,,,,,A F,2,2,2,0,fl:jo_ln:terrels-1,1,Joseph L. Terrels,fl:ch_ln:terrels-1,1,Christopher Terrels,,,,,,,,,,,,,,,,,,,,,,
5175912,1993,07/768958,1991,1,0,0,1,1,,0,,,,,A,2,2,2,0,qgnd5qj934wmox5afua51xckx,1,Gianandrea Chevalley,e34zmehobzriwxpk5i90801yw,1,Enzo De Carlo,,,,,,,,,,,,,,,,,,,,,,
5175913,1993,07/723272,1991,1,0,0,1,1,,0,,,,,A,2,2,2,0,fl:wa_ln:mackie-1,1,Wayne H. Mackie,j6x08pzl0jy1jxw81feubymt7,1,Christopher L. Finding,,,,,,,,,,,,,,,,,,,,,,
5175914,1993,07/337881,1989,1,1,1,1,1,YAMAZAKI MAZAK CORPORATION,0,MH,Ebeye,,,B,3,2,2,0,fl:yu_ln:mitsukuchi-1,1,Yukio Mitsukuchi,fl:sh_ln:hashimoto-36,,Shuichi Hashimoto,fl:sh_ln:momoi-1,1,Shoji Momoi,,,,,,,,,,,,,,,,,,,0
5175915,1993,07/732802,1991,1,0,0,1,1,,0,,,,,A B,2,2,2,0,fl:jo_ln:doyel-1,1,John S. Doyel,fl:ja_ln:trapp-2,1,James E. Trapp,,,,,,,,,,,,,,,,,,,,,,
5175916,1993,07/865911,1992,1,1,1,1,1,LEAR SEATING CORPORATION,0,US,Southfield,MI,Oakland,B,1,1,1,0,fl:wi_ln:klems-1,1,William F. Klems,,,,,,,,,,,,,,,,,,,,,,,,,0
5175917,1993,07/808482,1991,1,0,0,1,1,,0,,,,,B,1,1,1,0,fl:ti_ln:faccia-1,1,Tiziano Faccia,,,,,,,,,,,,,,,,,,,,,,,,,
5175918,1993,07/714708,1991,1,0,0,1,1,,0,,,,,B,1,1,1,0,fl:ga_ln:christopher-1,1,Gary Christopher,,,,,,,,,,,,,,,,,,,,,,,,,
5175919,1993,07/886685,1992,1,0,0,1,1,,0,,,,,A B,1,1,1,0,fl:ku_ln:lo-39,1,Kun-Nan Lo,,,,,,,,,,,,,,,,,,,,,,,,,
5175920,1993,07/764762,1991,1,0,0,1,1,,0,,,,,B,1,1,1,0,sioepoufq29c7fagbnb9b1wqk,1,Eugene Iversen,,,,,,,,,,,,,,,,,,,,,,,,,
5175921,1993,07/810854,1991,1,1,1,1,1,HARRIS CORPORATION,0,US,Melbourne,FL,Brevard,H,1,1,1,0,fl:wi_ln:krietzman-1,1,William Krietzman,,,,,,,,,,,,,,,,,,,,,,,,,0
5175922,1993,07/387501,1989,1,1,1,1,1,MANNESMANN AKTIENGESELLSCHAFT,0,DE,Düsseldorf,,,H,2,2,2,0,fl:be_ln:gugel-1,1,Bernd Gugel,fl:jo_ln:stempfle-1,1,Johann Stempfle,,,,,,,,,,,,,,,,,,,,,,0
5175923,1993,07/667744,1991,1,1,1,1,1,"MURATA MANUFACTURING CO., LTD.",0,JP,Kyoto,,,H,1,1,1,0,fl:hi_ln:kase-5,1,Hiroaki Kase,,,,,,,,,,,,,,,,,,,,,,,,,0
5175925,1993,07/871940,1992,1,1,1,1,1,AMP INCORPORATED,0,US,Harrisburg,PA,Dauphin,H,2,2,2,0,fl:jo_ln:grosklos-1,1,John R. Grosklos,fl:st_ln:lawruk-1,1,Stephen P. Lawruk,,,,,,,,,,,,,,,,,,,,,,0
5175926,1993,07/726442,1991,1,1,1,1,1,FORD MOTOR COMPANY,0,US,Dearborn,MI,Wayne,H,1,1,1,0,fl:ma_ln:chapman-7,1,Max C. Chapman,,,,,,,,,,,,,,,,,,,,,,,,,0
5175927,1993,07/769694,1991,1,1,1,1,1,EATON CORPORATION,0,US,Cleveland,OH,Cuyahoga,H,1,1,1,0,fl:jo_ln:coniff-1,1,John B. Coniff,,,,,,,,,,,,,,,,,,,,,,,,,0
5175928,1993,07/758221,1991,1,1,1,1,1,AMP INCORPORATED,0,US,Harrisburg,PA,Dauphin,H,1,1,1,0,fl:di_ln:grabbe-1,1,Dimitry G. Grabbe,,,,,,,,,,,,,,,,,,,,,,,,,0
5175929,1993,07/845992,1992,1,1,1,1,1,GENERAL ELECTRIC COMPANY,0,US,Schenectady,NY,Schenectady County,B,2,2,2,0,fl:th_ln:anthony-2,1,Thomas R. Anthony,fl:ja_ln:fleischer-1,1,James F. Fleischer,,,,,,,,,,,,,,,,,,,,,,0
5175930,1993,07/803963,1991,1,1,1,1,1,BRIDGESTONE CORPORATION,0,JP,Tokyo,,,B,3,3,3,0,fl:ko_ln:okuyama-12,1,Koji Okuyama,fl:ju_ln:nagano-3,1,Jun Nagano,fl:ta_ln:ishiwatari-5,1,Takashi Ishiwatari,,,,,,,,,,,,,,,,,,,0
5175931,1993,07/693474,1991,1,1,1,1,1,NTN CORPORATION,0,JP,Otobe,,,B,1,1,0,1,fl:yu_ln:ito-63,0,Yukifusa Ito,,,,,,,,,,,,,,,,,,,,,,,,,0
5175932,1993,07/796649,1991,1,1,1,1,1,ANDREAS STIHL AG & CO. KG,0,DE,Waiblingen,,,B,3,3,3,0,fl:ka_ln:lange-7,1,Karl-Heinz Lange,fl:he_ln:schlessmann-1,1,Helmut Schlessmann,fl:ha_ln:trumpf-1,1,Hans Trumpf,,,,,,,,,,,,,,,,,,,0
5175933,1993,07/846039,1992,1,0,0,1,1,,0,,,,,A B,1,1,1,0,fl:ja_ln:shepherd-17,1,James Shepherd,,,,,,,,,,,,,,,,,,,,,,,,,
5175934,1993,07/887480,1992,1,0,0,1,1,,0,,,,,B,1,1,0,1,fl:ch_ln:chao-171,0,Chung L. Chao,,,,,,,,,,,,,,,,,,,,,,,,,
5175935,1993,07/846260,1992,1,0,0,1,1,,0,,,,,G,1,1,1,0,fl:da_ln:welter-5,1,Daniel Welter,,,,,,,,,,,,,,,,,,,,,,,,,
5175936,1993,07/662365,1991,1,1,1,1,1,"CASIO COMPUTER CO., LTD.",0,JP,Tokyo,,,G,1,1,1,0,fl:hi_ln:sato-81,1,Hiroshi Sato,,,,,,,,,,,,,,,,,,,,,,,,,0
5175937,1993,07/760116,1991,1,0,0,1,1,,0,,,,,F,1,1,1,0,fl:je_ln:emerson-4,1,"Jerry T. Emerson, III",,,,,,,,,,,,,,,,,,,,,,,,,
5175938,1993,07/694802,1991,1,1,1,1,1,DIGITAL EQUIPMENT CORPORATION,0,US,Maynard,MA,Middlesex,B G,1,1,1,0,fl:al_ln:smith-113,1,Alan B. Smith,,,,,,,,,,,,,,,,,,,,,,,,,0
5175939,1993,07/869500,1992,1,0,0,1,1,,0,,,,,G,1,1,1,0,fl:he_ln:wolfram-1,1,Herbert Wolfram,,,,,,,,,,,,,,,,,,,,,,,,,
5175940,1993,07/747279,1991,1,0,0,1,1,,0,,,,,G,2,2,2,0,b9ne8whu6giet5migipgfd0qr,1,David A. Naill,fl:ge_ln:spector-1,1,George Spector,,,,,,,,,,,,,,,,,,,,,,
5175941,1993,07/816625,1991,1,1,1,1,1,THE UNITED STATES SHOE CORPORATION,0,US,Cincinnati,OH,Hamilton,A G,2,2,2,0,fl:th_ln:ziegler-2,1,Thomas Ziegler,fl:th_ln:kremer-2,1,Thomas Kremer,,,,,,,,,,,,,,,,,,,,,,0
5175942,1993,07/732980,1991,1,1,1,1,1,GTE PRODUCTS CORPORATION,0,US,Danvers,MA,Essex,F,3,3,3,0,fl:ar_ln:dutta-4,1,Arunava Dutta,fl:le_ln:dullea-1,1,Leonard V. Dullea,fl:er_ln:dale-3,1,Ernest A. Dale,,,,,,,,,,,,,,,,,,,0
5175943,1993,07/527738,1990,1,1,1,1,1,E. I. DU PONT DE NEMOURS AND COMPANY,0,US,Wilmington,DE,New Castle,F,2,2,2,0,fl:do_ln:eastham-1,1,Donald H. Eastham,fl:ja_ln:reeves-5,1,James W. Reeves,,,,,,,,,,,,,,,,,,,,,,0
5175944,1993,07/684324,1991,1,0,0,1,1,,0,,,,,F,1,1,1,0,cpdau1esz9gf46qhylp1dcee5,1,William L. Fruehauf,,,,,,,,,,,,,,,,,,,,,,,,,
5175945,1993,07/429730,1989,1,1,1,1,1,BELOIT CORPORATION,0,US,Beloit,WI,Rock,F,2,1,1,0,fl:bo_ln:skaugen-1,,Borgeir Skaugen,fl:gr_ln:wedel-1,1,Gregory L. Wedel,,,,,,,,,,,,,,,,,,,,,,0
5175946,1993,07/757849,1991,1,0,0,1,1,,0,,,,,A,1,1,1,0,fl:mi_ln:tsai-192,1,Ming-En Tsai,,,,,,,,,,,,,,,,,,,,,,,,,
5175947,1993,07/863354,1992,1,1,1,1,1,CONVERSE INC.,0,US,North Reading,MA,Middlesex,A,1,1,1,0,fl:ru_ln:parracho-1,1,Rui Parracho,,,,,,,,,,,,,,,,,,,,,,,,,0
5175948,1993,07/720139,1991,1,1,1,1,1,NORDICA S.P.A.,0,IT,Montebelluna,,,A,3,3,3,0,fl:va_ln:tonel-1,1,Valerio Tonel,fl:ma_ln:gonella-1,1,Mario Gonella,fl:ma_ln:tacchetto-1,1,Maurizio Tacchetto,,,,,,,,,,,,,,,,,,,0
5175949,1993,07/599484,1990,1,1,1,1,1,RAICHLE SPORTSCHUH AG,0,CH,Kreuzlingen,,,A,1,1,0,1,fl:si_ln:seidel-2,0,Sigurd Seidel,,,,,,,,,,,,,,,,,,,,,,,,,0
5175950,1993,07/865925,1992,1,0,0,1,1,,0,,,,,A,1,0,0,0,4wxg52mj1nxbwofwy76ed3eay,,Wyck R. Linder,,,,,,,,,,,,,,,,,,,,,,,,,
5175951,1993,07/633418,1991,1,1,1,1,1,"MAXX TECHNOLOGIES, INC.",0,US,Mentor,OH,Lake,A,1,1,1,0,fl:ru_ln:fruchey-1,1,Russell L. Fruchey,,,,,,,,,,,,,,,,,,,,,,,,,0
5175952,1993,07/731991,1991,1,1,1,1,1,SHIMANO INC.,0,JP,Osaka,,,A,1,1,1,0,fl:yo_ln:yamato-10,1,Yoshiro Yamato,,,,,,,,,,,,,,,,,,,,,,,,,0
5175953,1993,07/691522,1991,1,0,0,1,1,,0,,,,,A,1,1,1,0,35ngrz0db5kri2pmwquwy3zev,1,Richard J. Lesnock,,,,,,,,,,,,,,,,,,,,,,,,,
5175954,1993,07/859094,1992,1,1,1,1,1,SEIJI NAGUMO,1,JP,Shibukawa,,,A,1,1,1,0,w33ri8y4pflsmupyrs7ybo7yv,1,Seiji Nagumo,,,,,,,,,,,,,,,,,,,,,,,,,0
5175955,1993,07/818868,1992,1,1,1,1,1,"EBSCO INDUSTRIES, INC.",0,US,Leeds,AL,Jefferson County,A,2,2,2,0,fl:wi_ln:wilson-20,1,William H. Wilson,fl:bi_ln:murray-2,1,Bill Murray,,,,,,,,,,,,,,,,,,,,,,0
5175956,1993,07/798566,1991,1,0,0,1,1,,0,,,,,A,2,2,2,0,fl:jo_ln:hover-2,1,"John S. Hover, Sr.",yh2bvzr7o31xddx4cshgyr5pg,1,Rein Raamat,,,,,,,,,,,,,,,,,,,,,,
5175957,1993,07/895095,1992,1,0,0,1,1,,0,,,,,A,1,1,1,0,fl:le_ln:west-6,1,Leonard V. West,,,,,,,,,,,,,,,,,,,,,,,,,
5175958,1993,07/020381,1987,1,0,0,1,1,,0,,,,,A,1,1,1,0,fl:lo_ln:wedemeyer-1,1,Lowell R. Wedemeyer,,,,,,,,,,,,,,,,,,,,,,,,,
5175959,1993,07/684813,1991,1,0,0,1,1,,0,,,,,A,2,2,1,1,fl:mi_ln:scholnick-1,1,Michael Scholnick,fl:mi_ln:scholnick-2,0,Mildred C. Scholnick,,,,,,,,,,,,,,,,,,,,,,
5175960,1993,07/398338,1989,1,0,0,1,1,,0,,,,,A,2,2,1,1,fl:bi_ln:wade-1,1,Bill R. Wade,fl:th_ln:wade-1,0,Thelma L. Wade,,,,,,,,,,,,,,,,,,,,,,
5175961,1993,07/792149,1991,1,1,1,1,1,TEXACO INC.,0,GB,Otley,,,B,1,1,1,0,fl:jo_ln:bolton-6,1,John Bolton,,,,,,,,,,,,,,,,,,,,,,,,,0
5175962,1993,07/755400,1991,1,1,1,1,1,THE GLEASON WORKS,0,US,Rochester,NY,Monroe,B,1,1,1,0,fl:ha_ln:pedersen-6,1,Harry Pedersen,,,,,,,,,,,,,,,,,,,,,,,,,0
5175963,1993,07/623914,1990,1,1,1,1,1,ROBERT BOSCH GMBH,0,DE,Stuttgart,,,B,8,8,8,0,fl:di_ln:schafer-2,1,Dieter Schafer,fl:ka_ln:kober-2,1,Karl Kober,fl:vo_ln:lasch-1,1,"Volker Lasch, deceased",fl:ka_ln:treyz-1,1,Karl Treyz,fl:ma_ln:kirn-2,1,Manfred Kirn,fl:er_ln:borst-1,1,Erich Borst,fl:gu_ln:schaal-1,1,Gunter Schaal,fl:ku_ln:metzger-1,1,Kurt Metzger,,,,0
5175964,1993,07/736101,1991,1,0,0,1,1,,0,,,,,B,1,1,1,0,fl:ri_ln:girndt-1,1,Richard J. Girndt,,,,,,,,,,,,,,,,,,,,,,,,,
5175965,1993,07/632524,1990,1,1,1,1,1,SANDRA L. MILLER,1,US,Sterling Heights,MI,Macomb,B,1,1,1,0,fl:ke_ln:sanborn-4,1,Kenneth R. Sanborn,,,,,,,,,,,,,,,,,,,,,,,,,0
5175966,1993,07/755531,1991,1,1,1,1,1,"BETTER BILT PRODUCTS, INC.",0,US,Addison,IL,DuPage,E,2,2,2,0,fl:ma_ln:remke-2,1,Mark Remke,fl:fr_ln:camp-1,1,Frank Thomas Camp,,,,,,,,,,,,,,,,,,,,,,0
5175967,1993,07/694772,1991,1,0,0,1,1,,0,,,,,E,1,0,0,0,6vtk2ulcwv7kkwc5ij36i4gkw,,Harlow Greenwood,,,,,,,,,,,,,,,,,,,,,,,,,
5175968,1993,07/755145,1991,1,1,1,1,1,TERRY L. SAUCKE,1,US,Portland,ND,Traill,E,1,1,1,0,t6hjb0czspbxykv41mjt31rix,1,Terry L. Saucke,,,,,,,,,,,,,,,,,,,,,,,,,0
5175969,1993,07/711661,1991,1,1,1,1,1,STEELCASE INC.,0,US,Grand Rapids,MI,Kent,E,3,3,3,0,fl:ma_ln:knauf-3,1,Marvin C. Knauf,fl:st_ln:throndset-1,1,Steven J. Throndset,fl:li_ln:parker-3,1,Linda M. Parker,,,,,,,,,,,,,,,,,,,0
5175970,1993,07/543205,1990,1,1,1,1,1,"PEASE INDUSTRIES, INC.",0,US,Lancaster,OH,Fairfield,E,1,1,1,0,fl:f._ln:green-1,1,F. Richard Green,,,,,,,,,,,,,,,,,,,,,,,,,0
5175971,1993,07/716857,1991,1,0,0,1,1,,0,,,,,E,1,1,1,0,fl:p._ln:mccombs-1,1,P. Roger McCombs,,,,,,,,,,,,,,,,,,,,,,,,,
5175972,1993,06/626758,1984,1,1,1,1,1,HASNAIN INVESTMENTS (P) LIMITED,0,IN,Jamkhed,,,E,1,1,1,0,fl:be_ln:sridhara-1,1,Benne Narasimha Murthy Sridhara,,,,,,,,,,,,,,,,,,,,,,,,,0
5175973,1993,07/690072,1991,1,1,1,1,1,"SRAM, LLC",0,US,Alvin,TX,Brazoria County,E,3,3,3,0,fl:ri_ln:owen-6,1,Richard Alwyn Owen,qvtrskr6x9zz8qypo4mrigdt9,1,Richard C. Hanny,fl:ge_ln:harrison-5,1,George W. Harrison,,,,,,,,,,,,,,,,,,,0
5175974,1993,07/826348,1992,1,0,0,1,1,,0,,,,,E,3,3,3,0,fl:ly_ln:martinsen-1,1,Lyle J. Martinsen,fl:st_ln:martinsen-1,1,Stewart L. Martinsen,fl:la_ln:martinsen-1,1,Lane G. Martinsen,,,,,,,,,,,,,,,,,,,
5175975,1993,07/856840,1992,1,1,1,1,1,MIDWEST RESEARCH INSTITUTE,0,US,Kansas City,MO,Jackson County,E,2,2,2,0,fl:da_ln:benson-3,1,David K. Benson,fl:th_ln:potter-9,1,Thomas F. Potter,,,,,,,,,,,,,,,,,,,,,,0
5175976,1993,07/706810,1991,1,1,1,1,1,ROVEMA VERPACKUNGSMASCHINEN GMBH,0,DE,Reiskirchen,,,B,2,2,2,0,fl:ma_ln:petry-2,1,Martin Petry,nsj8cgzvlkke9b6agktfct515,1,Ralf Goersdorf,,,,,,,,,,,,,,,,,,,,,,0
5175977,1993,07/799223,1991,1,1,1,1,1,"BECTON, DICKINSON AND COMPANY",0,US,Franklin Lakes,NJ,Bergen,B,3,3,3,0,fl:ma_ln:crawford-16,1,Mark A. Crawford,fl:t._ln:guhl-1,1,T. Andrew Guhl,fl:j._ln:stanley-1,1,J. Robert Stanley,,,,,,,,,,,,,,,,,,,0
5175978,1993,07/806003,1991,1,1,1,1,1,INTERNATIONAL PAPER COMPANY,0,US,Purchase,NY,Westchester,B,1,1,1,0,fl:ga_ln:knauf-1,1,Gary H. Knauf,,,,,,,,,,,,,,,,,,,,,,,,,0
5175979,1993,07/707788,1991,1,1,1,1,1,HADEWE B.V.,0,NL,Drachten,,,B,2,1,1,0,fl:je_ln:vanderwerff-2,,Jeichienus A. van der Werff,fl:er_ln:vandervegte-1,1,Eric Willem Van Der Vegte,,,,,,,,,,,,,,,,,,,,,,0
5175980,1993,07/699897,1991,1,1,1,1,1,"SARDEE INDUSTRIES, INC.",0,US,Alsip,IL,Cook,B,5,5,5,0,fl:wa_ln:chiappe-1,1,Wayne T. Chiappe,fl:la_ln:ambrose-1,1,Larry R. Ambrose,fl:do_ln:dalmon-1,1,Donald P. Dalmon,fl:be_ln:juskie-1,1,Bernard R. Juskie,fl:ra_ln:godwin-2,1,Raymond E. Godwin,,,,,,,,,,,,,0
5175981,1993,07/674863,1991,1,1,1,1,1,"A.C.X., INC.",0,US,Bakersfield,CA,Kern,B,2,2,2,0,fl:jo_ln:gombos-1,1,John M. Gombos,fl:mo_ln:leashno-1,1,Moshe Leashno,,,,,,,,,,,,,,,,,,,,,,0
5175982,1993,07/719010,1991,1,1,1,1,1,HANS STAHLECKER,1,DE,Lassan,,,D,1,1,1,0,fl:fr_ln:stahlecker-1,1,Fritz Stahlecker,,,,,,,,,,,,,,,,,,,,,,,,,0
5175983,1993,07/808957,1991,1,1,1,1,1,SCHUBERT & SALZER,0,DE,Ingolstadt,,,D,3,3,3,0,fl:pe_ln:artzt-1,1,Peter Artzt,fl:he_ln:preininger-1,1,Heinrich Preininger,fl:ge_ln:egbers-1,1,Gerhard Egbers,,,,,,,,,,,,,,,,,,,0
5175984,1993,07/671790,1991,1,1,1,1,1,BRITISH TECHNOLOGY GROUP LIMITED,0,GB,London,,,A,3,3,2,1,fl:ol_ln:hale-1,1,Oliver D. Hale,fl:ro_ln:hobson-4,1,Robert N. Hobson,fl:vi_ln:nguyen-17,0,Vien N. Nguyen,,,,,,,,,,,,,,,,,,,0
5175985,1993,07/790475,1991,1,0,0,1,1,,0,,,,,B,1,1,1,0,fl:fr_ln:jetzinger-1,1,Franz Jetzinger,,,,,,,,,,,,,,,,,,,,,,,,,
5175986,1993,07/745699,1991,1,0,0,1,1,,0,,,,,B,1,1,1,0,fl:mi_ln:farley-3,1,Michael Farley,,,,,,,,,,,,,,,,,,,,,,,,,
5175987,1993,07/789033,1991,1,1,1,1,1,"PEQUEA MACHINE, INC.",0,US,Gordonville,PA,Lancaster,A,2,2,2,0,fl:ke_ln:underhill-3,1,Kenneth R. Underhill,fl:ja_ln:fisher-3,1,Jacob M. Fisher,,,,,,,,,,,,,,,,,,,,,,0
5175988,1993,07/845532,1992,1,1,1,1,1,"KANAI JUYO KOGYO CO., LTD.",0,JP,Kasai,,,D,1,1,1,0,fl:sh_ln:kibe-1,1,Shigeru Kibe,,,,,,,,,,,,,,,,,,,,,,,,,0
5175989,1993,07/546174,1990,1,1,1,1,1,AT&T BELL LABORATORIES,0,US,New Providence,NJ,Union,D F,1,0,0,0,fl:fr_ln:messina-3,,Frank D. Messina,,,,,,,,,,,,,,,,,,,,,,,,,0
5175990,1993,07/499381,1990,1,1,1,1,1,MASCHINENFABRIK RIETER AG,0,CH,Winterthur,,,D,3,3,3,0,fl:is_ln:fritschi-1,1,Isidor Fritschi,fl:ur_ln:meyer-3,1,Urs Meyer,fl:jo_ln:wernli-2,1,Jorg Wernli,,,,,,,,,,,,,,,,,,,0
5175991,1993,07/645562,1991,1,1,1,1,1,HANS STAHLECKER,1,DE,Lassan,,,D,1,1,1,0,fl:fr_ln:stahlecker-1,1,Fritz Stahlecker,,,,,,,,,,,,,,,,,,,,,,,,,1
5175992,1993,07/662704,1991,1,1,1,1,1,HANS STAHLECKER,1,DE,,,,D,1,1,1,0,fl:fr_ln:stahlecker-1,1,Fritz Stahlecker,,,,,,,,,,,,,,,,,,,,,,,,,0
5175993,1993,07/767241,1991,1,1,1,1,1,IMATRAN VOIMA OY,0,FI,,,,F,2,2,2,0,fl:ma_ln:raiko-1,1,Markku Raiko,h091lxxrvrv8w78jaszcdsh4b,1,Martti ijala,,,,,,,,,,,,,,,,,,,,,,0
5175994,1993,07/695377,1991,1,1,1,1,1,UNITED TECHNOLOGIES CORPORATION,0,US,Hartford,CT,Hartford,F,4,3,3,0,fl:th_ln:fox-15,1,Theodore G. Fox,fl:ma_ln:walsh-24,1,Martin Walsh,fl:be_ln:barnum-1,,Bethuel M. Barnum,fl:ja_ln:peyrot-1,1,Jan B. Peyrot,,,,,,,,,,,,,,,,0
5175995,1993,07/426206,1989,1,1,1,1,1,PYONG SIK PAK,1,JP,Takatsuki,,,F,3,3,2,1,fl:py_ln:pak-1,1,Pyong Sik Pak,fl:ke_ln:nakamura-32,1,Kenichi Nakamura,fl:yu_ln:suzuki-37,0,Yutaka Suzuki,,,,,,,,,,,,,,,,,,,0
5175996,1993,07/598457,1990,1,1,1,1,1,OLIN CORPORATION,0,US,Cheshire,CT,New Haven,H,1,1,0,1,fl:ri_ln:smith-21,0,Richard D. Smith,,,,,,,,,,,,,,,,,,,,,,,,,0
5175997,1993,07/806727,1991,1,0,0,1,1,,0,,,,,F,1,1,1,0,fl:jo_ln:blanke-2,1,John D. Blanke,,,,,,,,,,,,,,,,,,,,,,,,,
5175998,1993,07/440351,1989,1,0,0,1,1,,0,,,,,F,1,1,1,0,fl:le_ln:simuni-1,1,Leonid Simuni,,,,,,,,,,,,,,,,,,,,,,,,,
5175999,1993,07/786815,1991,1,1,1,1,1,"AISIN AW CO., LTD.",0,JP,,,,F,4,2,2,0,fl:ta_ln:hara-28,,Takeshi Hara,fl:hi_ln:kato-58,,Hideji Kato,fl:ka_ln:tsukamoto-4,1,Kazumasa Tsukamoto,fl:ta_ln:taniguchi-12,1,Takao Taniguchi,,,,,,,,,,,,,,,,0
5176000,1993,07/804745,1990,1,0,0,1,1,,0,,,,,F,1,1,1,0,ty26vux7jf9i6w5vvl4y3lrum,1,William P. Dauksis,,,,,,,,,,,,,,,,,,,,,,,,,
5176001,1993,07/767895,1991,1,1,1,1,1,HARSCO CORPORATION,0,US,Wormleysburg,PA,Cumberland,F,2,1,1,0,fl:za_ln:taylor-8,,Zachary Taylor,ekr2wyhlu2izg3rwn0zb39vdb,1,"Fred J. Darms, Jr.",,,,,,,,,,,,,,,,,,,,,,0
5176002,1993,07/683252,1991,1,1,1,1,1,"PROCESS SYSTEMS INTERNATIONAL, INC.",0,US,Westborough,MA,Worcester County,F,2,2,2,0,fl:jo_ln:o'brien-21,1,John V. O'Brien,fl:ro_ln:wojnarowski-1,1,Robert A. Wojnarowski,,,,,,,,,,,,,,,,,,,,,,0
5176003,1993,07/755238,1991,1,1,1,1,1,MITSUBISHI DENKI KABUSHIKI KAISHA,0,JP,Tokyo,,,F,3,2,2,0,fl:mi_ln:horikawa-2,,Mitsuo Horikawa,fl:ta_ln:matsumoto-85,1,Takahiro Matsumoto,fl:ka_ln:moritsu-1,1,Kazuki Moritsu,,,,,,,,,,,,,,,,,,,0
5176004,1993,07/717085,1991,1,1,1,1,1,HELIX TECHNOLOGY CORPORATION,0,US,Mansfield,MA,Bristol,B,1,1,1,0,fl:pe_ln:gaudet-1,1,Peter W. Gaudet,,,,,,,,,,,,,,,,,,,,,,,,,0
5176005,1993,07/917430,1992,1,1,1,1,1,"BALTIMORE AIRCOIL COMPANY, INC.",0,US,Baltimore,MD,Baltimore city,F,1,1,1,0,fl:vl_ln:kaplan-2,1,Vladimir Kaplan,,,,,,,,,,,,,,,,,,,,,,,,,0
5176006,1993,07/826881,1992,1,1,1,1,1,KABUSHIKI KAISHA TOSHIBA,0,JP,Kawasaki,,,F,2,1,0,1,fl:sh_ln:ikawa-5,,Shingo Ikawa,fl:mi_ln:mochizuki-17,0,Mitsuhiro Mochizuki,,,,,,,,,,,,,,,,,,,,,,0
5176007,1993,07/814440,1991,1,1,1,1,1,"JAPAN ELECTRONIC CONTROL SYSTEMS CO., LTD.",0,JP,Shibukawa,,,F,4,3,3,0,fl:sy_ln:komatsu-1,,Syunji Komatsu,fl:yu_ln:nakajima-33,1,Yuji Nakajima,fl:ma_ln:kuribara-1,1,Masaru Kuribara,fl:ka_ln:kobayashi-58,1,Kazumitsu Kobayashi,,,,,,,,,,,,,,,,1
5176008,1993,07/727612,1991,1,0,0,1,1,,0,,,,,F,1,1,1,0,fl:le_ln:vansteenburgh-1,1,"Leon R. Van Steenburgh, Jr.",,,,,,,,,,,,,,,,,,,,,,,,,
5176009,1993,07/827469,1992,1,1,1,1,1,FRITZ E. W. HIEBER,1,DE,Baden-Baden,,,A,1,0,0,0,fl:di_ln:lang-11,,Dieter Lang,,,,,,,,,,,,,,,,,,,,,,,,,0
5176010,1993,07/700503,1991,1,1,1,1,1,LIBA MASCHINENFABRIK GMBH,0,DE,,,,D,2,2,2,0,fl:ru_ln:wirth-1,1,Rudi Wirth,fl:wo_ln:jahn-2,1,Wolfgang Jahn,,,,,,,,,,,,,,,,,,,,,,0
5176011,1993,07/739331,1991,1,1,1,1,1,KABUSHIKI KAISHA TOSHIBA,0,JP,Yokohama,,,D,3,3,3,0,fl:ma_ln:imai-29,1,Masahiro Imai,fl:yo_ln:makino-16,1,Yosiyuki Makino,fl:hi_ln:ikeda-54,1,Hiroshi Ikeda,,,,,,,,,,,,,,,,,,,0
5176012,1993,07/728099,1991,1,1,1,1,1,"GOLD STAR CO., LTD.",0,KR,,,,D,4,3,3,0,fl:do_ln:oh-52,1,Dong Yeop Oh,fl:ja_ln:rew-2,1,Jae C. Rew,fl:kw_ln:park-107,1,Kwan R. Park,fl:in_ln:jung-14,,In C. Jung,,,,,,,,,,,,,,,,0
5176013,1993,07/888006,1992,1,0,0,1,1,,0,,,,,B,1,1,1,0,fl:ed_ln:kutauskas-1,1,Edmund A. Kutauskas,,,,,,,,,,,,,,,,,,,,,,,,,
5176014,1993,07/669472,1991,1,0,0,1,1,,0,,,,,F,1,1,1,0,fl:wi_ln:erickson-4,1,William C. Erickson,,,,,,,,,,,,,,,,,,,,,,,,,
5176015,1993,07/683151,1991,1,0,0,1,1,,0,,,,,E,1,1,1,0,fl:st_ln:sussina-1,1,Stan J. Sussina,,,,,,,,,,,,,,,,,,,,,,,,,
5176016,1993,07/854335,1992,1,0,0,1,1,,0,,,,,E,1,0,0,0,fl:ma_ln:hill-36,,Mark Hill,,,,,,,,,,,,,,,,,,,,,,,,,
5176017,1993,07/543836,1990,1,1,1,1,1,KABUSHIKI KAISHA KOMATSU SEISAKUSHO,0,JP,,,,B,1,1,1,0,fl:sh_ln:tokai-1,1,Shigeru Tokai,,,,,,,,,,,,,,,,,,,,,,,,,0
5176018,1993,07/770007,1991,1,1,1,1,1,GENERAL ELECTRIC COMPANY,0,US,Schenectady,NY,Schenectady County,B,1,1,1,0,fl:ro_ln:thompson-23,1,Robert A. Thompson,,,,,,,,,,,,,,,,,,,,,,,,,0
5176019,1993,07/568361,1990,1,1,1,1,1,ROLL FORMING CORPORATION,0,US,Shelbyville,KY,Shelby,B,1,1,0,1,fl:ba_ln:brooks-7,0,"Barlow W. Brooks, Jr.",,,,,,,,,,,,,,,,,,,,,,,,,0
5176020,1993,07/786789,1991,1,1,1,1,1,"NIPPONDENSO CO., LTD.",0,JP,Kariya,,,B,2,1,1,0,v2yj9p6dq8p1rity73zj8utdp,,Sizuo Maruo,fl:ak_ln:ichimura-4,1,Akira Ichimura,,,,,,,,,,,,,,,,,,,,,,0
5176021,1993,07/867286,1992,1,1,1,1,1,GRUNDFOS MANAGEMENT A/S,0,DK,Bjerringbro,,,B,2,2,2,0,fl:ni_ln:jensen-16,1,Niels D. Jensen,fl:so_ln:simonsen-1,1,Soren Simonsen,,,,,,,,,,,,,,,,,,,,,,0
5176022,1993,07/567727,1990,1,1,1,1,1,"AMADA COMPANY, LIMITED",0,JP,,,,B,1,1,1,0,fl:fr_ln:sartorio-1,1,Franco Sartorio,,,,,,,,,,,,,,,,,,,,,,,,,0
5176023,1993,07/819724,1992,1,1,1,1,1,CATERPILLAR INC.,0,US,Peoria,IL,Peoria County,B,1,1,1,0,fl:jo_ln:baldwin-20,1,John B. Baldwin,,,,,,,,,,,,,,,,,,,,,,,,,0
5176024,1993,07/557569,1990,1,1,1,1,1,COLT DEFENSE LLC,0,US,Town of West Hartford,CT,Hartford,G,1,1,1,0,fl:ro_ln:gancarz-1,1,Robert M. Gancarz,,,,,,,,,,,,,,,,,,,,,,,,,0
5176025,1993,07/657610,1991,1,1,1,1,1,E. O. BUTTS CONSULTANTS LTD.,0,CA,Ottawa,ON,,G,1,1,1,0,fl:ni_ln:butts-1,1,Nicholas E. Butts,,,,,,,,,,,,,,,,,,,,,,,,,0
5176026,1993,07/622844,1990,1,1,1,1,1,PROCEQ SA,0,CH,Zürich,,,G,2,2,2,0,fl:di_ln:leeb-1,1,Dietmar Leeb,a0gg5rj3hj7xor317pg2pyv9x,1,Ueli Brunner,,,,,,,,,,,,,,,,,,,,,,0
5176027,1993,07/640460,1991,1,1,1,1,1,MITSUBISHI DENKI K.K.,0,JP,Tokyo,,,G,1,1,1,0,fl:hi_ln:umemoto-11,1,Hideki Umemoto,,,,,,,,,,,,,,,,,,,,,,,,,0
5176028,1993,07/591119,1990,1,1,1,1,1,PORTLAND STATE UNIVERSITY,0,US,Eugene,OR,Lane,G,1,1,1,0,fl:ph_ln:humphrey-2,1,Philip Humphrey,,,,,,,,,,,,,,,,,,,,,,,,,0
5176029,1993,07/880234,1992,1,1,1,1,1,MARITRANS OPERATING PARTNERS L.P.,0,US,Philadelphia,PA,Philadelphia,G,1,1,1,0,ppjxr65ip0bqxjm82ey6d3ihe,1,E. Carl Dittrich,,,,,,,,,,,,,,,,,,,,,,,,,0