patent_number,grant_year,application_number,application_year,d_inventor,d_assignee,d_location,d_application,d_ipc,assignee,assignee_ind,country,city,state,county,ipc_section,team_size,inventors,men_inventors,women_inventors,inventor_id1,male_flag1,inventor_name1,inventor_id2,male_flag2,inventor_name2,inventor_id3,male_flag3,inventor_name3,inventor_id4,male_flag4,inventor_name4,inventor_id5,male_flag5,inventor_name5,inventor_id6,male_flag6,inventor_name6,inventor_id7,male_flag7,inventor_name7,inventor_id8,male_flag8,inventor_name8,inventor_id9,male_flag9,inventor_name9,assignee_sequence
5377359,1995,08/164965,1993,1,1,1,1,1,"QLH USA, INC.",0,US,San Francisco,CA,San Francisco,A,1,1,1,0,fl:cu_ln:jiang-1,1,Curtis T. Jiang,,,,,,,,,,,,,,,,,,,,,,,,,0
5377360,1995,08/071661,1993,1,0,0,1,1,,0,,,,,A,1,1,1,0,fl:je_ln:fleitman-2,1,Jeffrey P. Fleitman,,,,,,,,,,,,,,,,,,,,,,,,,
5377361,1995,08/253644,1994,1,0,0,1,1,,0,,,,,E,1,1,1,0,fl:ja_ln:piskula-1,1,James Piskula,,,,,,,,,,,,,,,,,,,,,,,,,
5377362,1995,07/932769,1992,1,0,0,1,1,,0,,,,,E,1,1,0,1,fl:in_ln:jackson-2,0,Ingrid Jackson,,,,,,,,,,,,,,,,,,,,,,,,,
5377363,1995,08/207695,1994,1,0,0,1,1,,0,,,,,E,1,1,1,0,nb6ytswvghftzhztjlsvqd5vb,1,Snoopy Shieh,,,,,,,,,,,,,,,,,,,,,,,,,
5377364,1995,08/054621,1993,1,0,0,1,1,,0,,,,,A,1,1,1,0,fl:jo_ln:cabrera-2,1,Jorge Cabrera,,,,,,,,,,,,,,,,,,,,,,,,,
5377365,1995,08/251344,1994,1,0,0,1,1,,0,,,,,A,1,0,0,0,fl:sh_ln:hakim-4,,Shaharazard H. Hakim,,,,,,,,,,,,,,,,,,,,,,,,,
5377366,1995,08/066592,1993,1,0,0,1,1,,0,,,,,A,2,2,2,0,fl:ke_ln:boyd-10,1,Kenneth Boyd,tjjcfq77w5xg2wpy7qdyer8wr,1,Gussie B. Boyd,,,,,,,,,,,,,,,,,,,,,,
5377367,1995,08/124270,1993,1,1,1,1,1,FRIEDRICH GROHE AG & CO. KG,0,DE,Hemer,,,A,1,1,1,0,fl:be_ln:bischoff-2,1,Bernd Bischoff,,,,,,,,,,,,,,,,,,,,,,,,,0
5377368,1995,08/110927,1993,1,1,1,1,1,TOP FORTUNE LTD.,0,US,San Diego,CA,San Diego,A,1,1,0,1,fl:yi_ln:cheng-122,0,Ying-Hsiung Cheng,,,,,,,,,,,,,,,,,,,,,,,,,0
5377369,1995,08/170715,1993,1,1,1,1,1,"PARAMOUNT BED CO., LTD.",0,JP,Tokyo,,,A,1,1,1,0,fl:ku_ln:shirai-5,1,Kunito Shirai,,,,,,,,,,,,,,,,,,,,,,,,,0
5377370,1995,08/074925,1993,1,1,1,1,1,"HILL-ROM COMPANY, INC.",0,US,Batesville,IN,Ripley County,A,2,2,2,0,fl:l._ln:foster-1,1,L. Dale Foster,fl:ry_ln:reeder-1,1,Ryan A. Reeder,,,,,,,,,,,,,,,,,,,,,,0
5377371,1995,07/991445,1992,1,1,1,1,1,"HILL-ROM COMPANY, INC.",0,US,Batesville,IN,Ripley County,F,1,1,1,0,fl:l._ln:foster-1,1,L. Dale Foster,,,,,,,,,,,,,,,,,,,,,,,,,0
5377372,1995,08/041008,1993,1,1,1,1,1,"HILL-ROM COMPANY, INC.",0,US,Batesville,IN,Ripley County,A B,2,2,2,0,fl:ke_ln:rudolf-1,1,Kenneth Rudolf,fl:da_ln:williams-115,1,David W. Williams,,,,,,,,,,,,,,,,,,,,,,0
5377373,1995,08/170716,1993,1,1,1,1,1,"PARAMOUNT BED CO., LTD.",0,JP,Tokyo,,,A,1,1,1,0,fl:ku_ln:shirai-5,1,Kunito Shirai,,,,,,,,,,,,,,,,,,,,,,,,,0
5377374,1995,08/130793,1993,1,0,0,1,1,,0,,,,,A,1,0,0,0,fl:wi_ln:green-6,,William J. Green,,,,,,,,,,,,,,,,,,,,,,,,,
5377375,1995,08/194502,1994,1,1,1,1,1,BTR PLC,0,GB,London,,,A,2,2,2,0,fl:an_ln:holman-3,1,Andrew Holman,r404wu1vml562al2y4n4ffwfx,1,Graham Fairbrass,,,,,,,,,,,,,,,,,,,,,,0
5377376,1995,08/110362,1993,1,1,1,1,1,ADVANCE MACHINE COMPANY,0,US,Plymouth,MN,Hennepin,E,2,2,2,0,fl:da_ln:wood-18,1,David W. Wood,fl:ra_ln:brunn-1,1,Randy J. Brunn,,,,,,,,,,,,,,,,,,,,,,0
5377377,1995,08/201919,1994,1,1,1,1,1,GILLETTE CANADA INC.,0,CA,Kirkland,QC,,A,2,2,2,0,fl:wi_ln:bredall-1,1,William A. Bredall,fl:gr_ln:simms-1,1,Graham John Simms,,,,,,,,,,,,,,,,,,,,,,0
5377378,1995,08/176997,1994,1,0,0,1,1,,0,,,,,A,1,1,1,0,fl:ba_ln:cutler-1,1,Barry L. Cutler,,,,,,,,,,,,,,,,,,,,,,,,,
5377379,1995,08/231319,1994,1,0,0,1,1,,0,,,,,B F,1,1,1,0,fl:ne_ln:lo-1,1,Neng S. Lo,,,,,,,,,,,,,,,,,,,,,,,,,
5377380,1995,07/559145,1990,1,0,0,1,1,,0,,,,,B,1,1,1,0,fl:ro_ln:reaves-3,1,Ronald Reaves,,,,,,,,,,,,,,,,,,,,,,,,,
5377381,1995,07/966359,1992,1,0,0,1,1,,0,,,,,B,1,1,1,0,fl:ed_ln:wilson-11,1,Edward G. Wilson,,,,,,,,,,,,,,,,,,,,,,,,,
5377382,1995,08/060874,1993,1,1,1,1,1,"WINDSOR INDUSTRIES, INC.",0,US,Englewood,CO,Arapahoe,A,2,2,2,0,fl:fr_ln:bores-1,1,Frederick M. Bores,fl:th_ln:plaven-1,1,Thomas Plaven,,,,,,,,,,,,,,,,,,,,,,0
5377383,1995,08/090016,1993,1,0,0,1,1,,0,,,,,A,1,1,1,0,fl:la_ln:christensen-26,1,Lars Bager Christensen,,,,,,,,,,,,,,,,,,,,,,,,,
5377384,1995,08/042967,1993,1,0,0,1,1,,0,,,,,E,1,1,1,0,fl:ha_ln:riegelman-1,1,Harry M. Riegelman,,,,,,,,,,,,,,,,,,,,,,,,,
5377385,1995,07/856951,1992,1,1,1,1,1,MASCHINENFABRIK RIETER AG,0,CH,Winterthur,,,D,3,3,3,0,fl:er_ln:jornot-1,1,Erich Jornot,fl:ra_ln:wicki-1,1,Raphael Wicki,fl:ur_ln:keller-1,1,Urs Keller,,,,,,,,,,,,,,,,,,,0
5377386,1995,08/137639,1993,1,1,1,1,1,STURGES MANUFACTURING CO.,0,US,Utica,NY,Oneida,A,1,1,1,0,fl:ri_ln:griffith-6,1,Richard R. Griffith,,,,,,,,,,,,,,,,,,,,,,,,,0
5377387,1995,08/022354,1993,1,0,0,1,1,,0,,,,,B,1,1,1,0,fl:an_ln:freed-2,1,Anna B. Freed,,,,,,,,,,,,,,,,,,,,,,,,,
5377388,1995,08/173769,1993,1,1,1,1,1,"DECOR CONCEPTS, INC.",0,US,Arcadia,CA,Los Angeles,B,1,1,1,0,5vu3rqsogwi8f32s4a320atxm,1,Bruce J. DeBever,,,,,,,,,,,,,,,,,,,,,,,,,0
5377389,1995,08/201937,1994,1,1,1,1,1,ETABLISSEMENTS CAILLAU,0,FR,Issy-les-Moulineaux,,,B F,2,2,2,0,fl:li_ln:calmettes-1,1,Lionel Calmettes,fl:pa_ln:detable-1,1,Pascal Detable,,,,,,,,,,,,,,,,,,,,,,0
5377390,1995,08/071896,1993,1,0,0,1,1,,0,,,,,A,1,1,0,1,fl:yu_ln:huang-53,0,Yu-Lin Huang,,,,,,,,,,,,,,,,,,,,,,,,,
5377391,1995,07/962659,1992,1,0,0,1,1,,0,,,,,A,1,1,1,0,fl:wi_ln:foster-20,1,Wilbur A. Foster,,,,,,,,,,,,,,,,,,,,,,,,,
5377392,1995,08/043484,1993,1,0,0,1,1,,0,,,,,A,1,0,0,0,fl:ta_ln:morita-40,,Tamao Morita,,,,,,,,,,,,,,,,,,,,,,,,,
5377393,1995,08/116494,1993,1,1,1,1,1,TRW VEHICLE SAFETY SYSTEMS INC.,0,US,Lyndhurst,OH,Cuyahoga,A,1,1,1,0,fl:ro_ln:ellis-24,1,Robert P. Ellis,,,,,,,,,,,,,,,,,,,,,,,,,0
5377394,1995,07/172031,1993,1,0,0,1,1,,0,,,,,A,1,1,1,0,fl:ge_ln:fildan-1,1,Gerhard Fildan,,,,,,,,,,,,,,,,,,,,,,,,,
5377395,1995,08/057655,1993,1,1,1,1,1,"BATESVILLE SERVICES, INC.",0,US,Batesville,IN,Ripley County,A,2,2,2,0,fl:do_ln:maier-4,1,Donald R. Maier,fl:jo_ln:linville-3,1,John E. Linville,,,,,,,,,,,,,,,,,,,,,,0
5377396,1995,08/026603,1993,1,1,1,1,1,QUEBEC INC.,0,US,Chagrin Falls,OH,Cuyahoga,B,1,1,1,0,fl:th_ln:moran-7,1,Thomas F. Moran,,,,,,,,,,,,,,,,,,,,,,,,,0
5377397,1995,08/202024,1994,1,0,0,1,1,,0,,,,,B,2,2,1,1,fl:ch_ln:yu-615,0,Chih-Wan Yu,fl:ch_ln:yu-267,1,Chih-Yung Yu,,,,,,,,,,,,,,,,,,,,,,
5377398,1995,08/044946,1993,1,1,1,1,1,KOLENE CORPORATION,0,US,Detroit,MI,Wayne,B C,1,1,1,0,fl:ch_ln:bessey-1,1,Charles M. Bessey,,,,,,,,,,,,,,,,,,,,,,,,,0
5377399,1995,08/145642,1993,1,1,1,1,1,"FUJI PHOTO FILM CO., LTD.",0,JP,Yokohama,,,B,1,1,1,0,fl:ma_ln:ogawa-60,1,Masazumi Ogawa,,,,,,,,,,,,,,,,,,,,,,,,,0
5377400,1995,08/149573,1993,1,1,1,1,1,HEWING GMBH,0,DE,Ochtrup,,,B,1,1,1,0,fl:ka_ln:homm-1,1,Karl-Georg Homm,,,,,,,,,,,,,,,,,,,,,,,,,0
5377401,1995,08/099587,1993,1,1,1,1,1,INSTITUT FRANCAIS DU PETROLE,0,FR,Rueil-Malmaison,,,B,1,1,1,0,fl:mi_ln:huvey-1,1,Michel Huvey,,,,,,,,,,,,,,,,,,,,,,,,,0
5377402,1995,08/144234,1993,1,0,0,1,1,,0,,,,,H,1,1,1,0,fl:al_ln:semple-2,1,"Alan R. Semple, Jr.",,,,,,,,,,,,,,,,,,,,,,,,,
5377403,1995,08/103146,1993,1,1,1,1,1,DELCO ELECTRONICS CORPORATION,0,US,Kokomo,IN,Howard,H,2,2,2,0,fl:jo_ln:hart-33,1,John Hart,fl:jo_ln:matly-1,1,John Michael Matly,,,,,,,,,,,,,,,,,,,,,,0
5377404,1995,08/166166,1993,1,0,0,1,1,,0,,,,,B H,1,1,1,0,fl:n._ln:berg-1,1,N. Edward Berg,,,,,,,,,,,,,,,,,,,,,,,,,
5377405,1995,08/086512,1993,1,1,1,1,1,YAMAHA HATSUDOKI KABUSHIKI KAISHA,0,JP,Iwata,,,B H,4,3,3,0,fl:hi_ln:sakurai-35,1,Hiroshi Sakurai,fl:hi_ln:onodera-13,,Hitoshi Onodera,fl:ke_ln:indo-3,1,Kenichi Indo,fl:hi_ln:ohta-40,1,Hiroyuki Ohta,,,,,,,,,,,,,,,,0
5377406,1995,08/158300,1993,1,1,1,1,1,CMK CORPORATION,0,JP,,,,H,3,3,3,0,fl:ma_ln:matsumoto-20,1,Masuo Matsumoto,fl:na_ln:yoshida-18,1,Naohiro Yoshida,fl:ma_ln:kojima-20,1,Masaru Kojima,,,,,,,,,,,,,,,,,,,0
5377407,1995,08/144354,1993,1,1,1,1,1,EBARA CORPORATION,0,JP,Tokyo,,,B,2,2,2,0,fl:ts_ln:takahashi-11,1,Tsutomu Takahashi,fl:sh_ln:nakahama-1,1,Shuhei Nakahama,,,,,,,,,,,,,,,,,,,,,,0
5377408,1995,08/130235,1993,1,1,1,1,1,HARNISCHFEGER CORPORATION,0,US,Brookfield,WI,Waukesha,B,2,2,2,0,fl:ha_ln:kallenberger-1,1,Harvey J. Kallenberger,fl:em_ln:tossenberger-1,1,Emeric G. Tossenberger,,,,,,,,,,,,,,,,,,,,,,0
5377409,1995,07/958407,1992,1,1,1,1,1,WARNER-LAMBERT COMPANY,0,US,Morristown,NJ,Morris,B,1,1,0,1,fl:ev_ln:chen-4,0,Evan N. Chen,,,,,,,,,,,,,,,,,,,,,,,,,0
5377410,1995,08/142233,1993,1,0,0,1,1,,0,,,,,H,1,1,1,0,fl:wa_ln:welch-3,1,Wade Welch,,,,,,,,,,,,,,,,,,,,,,,,,
5377411,1995,08/084147,1993,1,0,0,1,1,,0,,,,,B,1,1,1,0,fl:de_ln:andriotis-1,1,Demetrios Andriotis,,,,,,,,,,,,,,,,,,,,,,,,,
5377412,1995,07/978211,1992,1,1,1,1,1,FISKARS OY AB,0,FI,Helsinki,,,B,3,3,3,0,fl:ro_ln:schofield-3,1,Robert T. Schofield,fl:cr_ln:melter-1,1,Craig H. Melter,fl:do_ln:birkholz-1,1,Douglas J. Birkholz,,,,,,,,,,,,,,,,,,,0
5377413,1995,08/060347,1993,1,0,0,1,1,,0,,,,,B,1,1,1,0,fl:jo_ln:masse-2,1,Joseph H. Masse,,,,,,,,,,,,,,,,,,,,,,,,,
5377414,1995,08/146512,1993,1,1,1,1,1,U.S. PHILIPS CORPORATION,0,US,New York,NY,New York County,B,2,2,2,0,fl:va_ln:buzzi-1,1,Valentin Buzzi,fl:fe_ln:sereinig-1,1,Ferdinand Sereinig,,,,,,,,,,,,,,,,,,,,,,0
5377415,1995,08/165332,1993,1,0,0,1,1,,0,,,,,B,1,1,1,0,fl:jo_ln:gibson-31,1,John Gibson,,,,,,,,,,,,,,,,,,,,,,,,,
5377416,1995,08/186992,1994,1,0,0,1,1,,0,,,,,B,1,1,1,0,kjj297ggg48eb59vlt26fvt4a,1,Mark A. Petraccoro,,,,,,,,,,,,,,,,,,,,,,,,,
5377417,1995,08/050222,1993,1,0,0,1,1,,0,,,,,G,1,1,1,0,fl:ge_ln:sentman-1,1,Gerald K. Sentman,,,,,,,,,,,,,,,,,,,,,,,,,
5377418,1995,08/110316,1993,1,0,0,1,1,,0,,,,,B,1,1,1,0,fl:de_ln:anderson-41,1,Dean H. Anderson,,,,,,,,,,,,,,,,,,,,,,,,,
5377419,1995,08/064898,1993,1,0,0,1,1,,0,,,,,G,1,1,1,0,fl:de_ln:hesseltine-1,1,Dennis R. Hesseltine,,,,,,,,,,,,,,,,,,,,,,,,,
5377420,1995,08/171667,1993,1,1,1,1,1,FIDIA S.P.A.,0,IT,San Mauro Torinese,,,G,2,2,2,0,fl:ma_ln:vesco-1,1,Mario Vesco,fl:gi_ln:zaramella-1,1,Giancarlo Zaramella,,,,,,,,,,,,,,,,,,,,,,0
5377421,1995,08/054288,1993,1,0,0,1,1,,0,,,,,G,1,1,1,0,fl:da_ln:isler-1,1,David Isler,,,,,,,,,,,,,,,,,,,,,,,,,
5377422,1995,08/143791,1993,1,1,1,1,1,"STRETCH DEVICES, INC.",0,US,Philadelphia,PA,Philadelphia,B,1,1,0,1,fl:do_ln:newman-5,0,Donald E. Newman,,,,,,,,,,,,,,,,,,,,,,,,,0
5377423,1995,08/115193,1993,1,1,1,1,1,NAGAOKA INTERNATIONAL CORPORATION,0,JP,,,,F,1,1,1,0,fl:ta_ln:nagaoka-20,1,Tadayoshi Nagaoka,,,,,,,,,,,,,,,,,,,,,,,,,0
5377424,1995,08/137404,1993,1,0,0,1,1,,0,,,,,F,1,1,1,0,nrl4f54jqa4vd69xrjp1od02u,1,Leandro R. Albanes,,,,,,,,,,,,,,,,,,,,,,,,,
5377425,1995,07/934655,1993,1,1,1,1,1,"NIKKU INDUSTRY CO., LTD.",0,JP,Itami,,,F,2,2,2,0,fl:os_ln:kawakami-1,1,Osamu Kawakami,fl:ka_ln:tsuruta-5,1,Kaichi Tsuruta,,,,,,,,,,,,,,,,,,,,,,0
5377426,1995,08/012475,1993,1,1,1,1,1,"HER MAJESTY THE QUEEN IN RIGHT OF CANADA, AS REPRESENTED BY THE MINISTER OF HEALTH",0,CA,Schreiber,ON,,F,1,1,0,1,fl:j._ln:pare-2,0,J. R. Jocelyn Pare,,,,,,,,,,,,,,,,,,,,,,,,,0
5377427,1995,08/098228,1993,1,0,0,1,1,,0,,,,,F,1,1,1,0,fl:mo_ln:mashata-1,1,Moshe Mashata,,,,,,,,,,,,,,,,,,,,,,,,,
5377428,1995,08/120449,1993,1,1,1,1,1,VIRGINIA COMMONWEALTH UNIVERSITY,0,US,Richmond,VA,Richmond city,F,1,1,1,0,fl:ra_ln:clark-40,1,Ralph C. Clark,,,,,,,,,,,,,,,,,,,,,,,,,0
5377429,1995,08/049565,1993,1,1,1,1,1,"MICRON SEMICONDUCTOR, INC.",0,US,Boise,ID,Ada,F,3,3,3,0,fl:gu_ln:sandhu-13,1,Gurtej S. Sandhu,fl:sc_ln:meikle-1,1,Scott Meikle,fl:do_ln:westmoreland-2,1,Donald L. Westmoreland,,,,,,,,,,,,,,,,,,,0
5377430,1995,08/122335,1993,1,1,1,1,1,"NIKE, INC.",0,US,Beaverton,OR,Washington,A,2,1,1,0,fl:ti_ln:hatfield-1,,Tinker L. Hatfield,fl:wi_ln:dieter-2,1,William M. Dieter,,,,,,,,,,,,,,,,,,,,,,0
5377431,1995,08/078628,1993,1,0,0,1,1,,0,,,,,A,2,2,1,1,fl:an_ln:walker-27,0,Andrew S. Walker,fl:el_ln:gooding-1,1,Elwyn R. Gooding,,,,,,,,,,,,,,,,,,,,,,
5377432,1995,08/139217,1993,1,1,1,1,1,THE ASAN FOUNDATION,0,JP,Ashikaga,,,B,1,1,1,0,fl:mi_ln:kishi-7,1,Mitsuhiro Kishi,,,,,,,,,,,,,,,,,,,,,,,,,0
5377433,1995,07/909614,1992,1,0,0,1,1,,0,,,,,G,1,1,1,0,fl:la_ln:hazlehurst-1,1,Laurance N. Hazlehurst,,,,,,,,,,,,,,,,,,,,,,,,,
5377434,1995,08/143096,1993,1,0,0,1,1,,0,,,,,G,1,1,0,1,fl:ar_ln:wilson-2,0,Arthur K. Wilson,,,,,,,,,,,,,,,,,,,,,,,,,
5377435,1995,08/092229,1993,1,0,0,1,1,,0,,,,,G,1,1,1,0,fl:el_ln:dalton-2,1,Eldon L. Dalton,,,,,,,,,,,,,,,,,,,,,,,,,
5377436,1995,08/088220,1993,1,0,0,1,1,,0,,,,,F,1,1,1,0,fl:ro_ln:switzer-4,1,Robert D. Switzer,,,,,,,,,,,,,,,,,,,,,,,,,
5377437,1995,08/241563,1994,1,0,0,1,1,,0,,,,,F,1,1,1,0,fl:jo_ln:underwood-17,1,John Underwood,,,,,,,,,,,,,,,,,,,,,,,,,
5377438,1995,08/135738,1993,1,1,1,1,1,ETZION METAL WORKS,0,IL,,,,F,2,2,2,0,fl:na_ln:sheinfeld-1,1,Naftali Sheinfeld,fl:mi_ln:cohen-35,1,Michael J. Cohen,,,,,,,,,,,,,,,,,,,,,,0
5377439,1995,08/152048,1993,1,0,0,1,1,,0,,,,,A,2,2,2,0,fl:ri_ln:roos-3,1,"Richard J. Roos, Jr.",fl:ri_ln:roos-3,1,"Richard J. Roos, Jr.",,,,,,,,,,,,,,,,,,,,,,
5377440,1995,08/172215,1993,1,1,1,1,1,BERU RUPRECHT GMBH & CO. KG,0,DE,Ludwigsburg,,,F,2,2,2,0,fl:ma_ln:eller-4,1,Martin Eller,fl:od_ln:peters-1,1,Odd Peters,,,,,,,,,,,,,,,,,,,,,,0
5377441,1995,07/926632,1992,1,1,1,1,1,SHIMANO INC.,0,JP,Osaka,,,A,1,1,1,0,fl:hi_ln:noda-22,1,Hideo Noda,,,,,,,,,,,,,,,,,,,,,,,,,0
5377442,1995,08/056715,1993,1,0,0,1,1,,0,,,,,A,1,1,1,0,fl:ba_ln:gariglio-1,1,Barry Gariglio,,,,,,,,,,,,,,,,,,,,,,,,,
5377443,1995,08/186235,1994,1,0,0,1,1,,0,,,,,A,2,2,1,1,3d2e4kctlttq8aenaovc4altu,0,Nancie Giray,rw715sq4kmklkvbhn79yjp07c,1,Gary L. Giray,,,,,,,,,,,,,,,,,,,,,,
5377444,1995,08/155189,1993,1,0,0,1,1,,0,,,,,A,1,1,1,0,fl:ja_ln:gibney-2,1,"James W. Gibney, Sr.",,,,,,,,,,,,,,,,,,,,,,,,,
5377445,1995,07/344137,1989,1,0,0,1,1,,0,,,,,A B,1,1,1,0,fl:ro_ln:brannon-4,1,Roland Brannon,,,,,,,,,,,,,,,,,,,,,,,,,
5377446,1995,08/098130,1993,1,0,0,1,1,,0,,,,,A,1,1,1,0,d4bk4rgliuxqa381edjd5oe33,1,Richard DiLeo,,,,,,,,,,,,,,,,,,,,,,,,,
5377447,1995,07/967111,1992,1,0,0,1,1,,0,,,,,A,1,1,1,0,fl:jo_ln:fritch-1,1,John R. Fritch,,,,,,,,,,,,,,,,,,,,,,,,,
5377448,1995,08/007673,1993,1,1,1,1,1,"AMERICAN METAL DOOR COMPANY, INC.",0,US,Crawfordsville,IN,Montgomery,E,2,1,1,0,fl:do_ln:boyd-4,,Douglas E. Boyd,fl:ch_ln:burton-5,1,Charles A. Burton,,,,,,,,,,,,,,,,,,,,,,0
5377449,1995,08/068552,1993,1,1,1,1,1,"NISHIKAWA RUBBER CO., LTD.",0,JP,Hiroshima,,,E,3,3,3,0,mf020tooxtqkpd5oquxw42w8s,1,Takashi Hineribara,fl:ya_ln:kamei-4,1,Yasunori Kamei,fl:ry_ln:miura-2,1,Ryusuke Miura,,,,,,,,,,,,,,,,,,,0
5377450,1995,08/173103,1993,1,1,1,1,1,GENERAL MOTORS CORPORATION,0,US,Detroit,MI,Wayne,B E,1,1,1,0,5lgp1litvy0mcvwa2csq2d9hc,1,Joseph Varajon,,,,,,,,,,,,,,,,,,,,,,,,,0
5377451,1995,08/021215,1993,1,1,1,1,1,"MEMC ELECTRONIC MATERIALS, INC.",0,US,Saint Peters,MO,Saint Charles County,B,3,3,3,0,fl:fa_ln:leoni-1,1,Fabrizio Leoni,fl:ma_ln:morganti-1,1,Marco Morganti,ttmatpwyelacuych3a8znq30a,1,Luigi Vesco,,,,,,,,,,,,,,,,,,,0
5377452,1995,07/982865,1992,1,1,1,1,1,SONY CORPORATION,0,JP,Tokyo,,,B,1,1,1,0,fl:yo_ln:yamaguchi-68,1,Yoshihiro Yamaguchi,,,,,,,,,,,,,,,,,,,,,,,,,0
5377453,1995,08/016899,1993,1,0,0,1,1,,0,,,,,B,1,1,1,0,fl:ge_ln:perneczky-1,1,George C. Perneczky,,,,,,,,,,,,,,,,,,,,,,,,,
5377454,1995,07/877910,1992,1,1,1,1,1,THE GLEASON WORKS,0,US,Rochester,NY,Monroe,B,2,2,2,0,fl:ha_ln:pedersen-6,1,Harry Pedersen,fl:ri_ln:kitchen-3,1,Richard L. Kitchen,,,,,,,,,,,,,,,,,,,,,,0
5377455,1995,08/057504,1993,1,1,1,1,1,MINNESOTA MINING AND MANUFACTURING COMPANY,0,US,Windom,MN,Cottonwood,B,1,1,1,0,fl:da_ln:lanzer-1,1,David J. Lanzer,,,,,,,,,,,,,,,,,,,,,,,,,0
5377456,1995,07/986463,1992,1,1,1,1,1,"COBURN OPTICAL INDUSTRIES, INC.",0,US,Tulsa,OK,Tulsa County,B,1,0,0,0,fl:wi_ln:dixon-10,,William Dixon,,,,,,,,,,,,,,,,,,,,,,,,,0
5377457,1995,08/061864,1993,1,1,1,1,1,HURTH MASCHINEN UND WERKZEUGE GMBH,0,DE,Munich,,,B,2,1,1,0,fl:he_ln:loos-6,1,Herbert Loos,fl:ma_ln:erhardt-3,,Manfred Erhardt,,,,,,,,,,,,,,,,,,,,,,0
5377458,1995,08/032387,1993,1,1,1,1,1,"DECISIONS TEAM, INC.",0,US,Fort Worth,TX,Tarrant County,E,1,1,1,0,fl:wi_ln:dempster-2,1,William F. Dempster,,,,,,,,,,,,,,,,,,,,,,,,,0
5377459,1995,08/099255,1993,1,0,0,1,1,,0,,,,,B E,1,1,1,0,fl:be_ln:freiborg-2,1,Bennie Freiborg,,,,,,,,,,,,,,,,,,,,,,,,,
5377460,1995,08/073084,1993,1,0,0,1,1,,0,,,,,E,1,1,1,0,fl:ca_ln:hicks-7,1,Carl Hicks,,,,,,,,,,,,,,,,,,,,,,,,,
5377461,1995,08/011368,1993,1,1,1,1,1,OMASA S.R.L.,0,IT,Pieve di Cadore,,,E,2,2,2,0,e2jbvavv0hhnmfsd7utg2c51h,1,Bruno DeGrada,5hddx0iusmxbj23vj1e5s8rfn,1,Guido Ortolani,,,,,,,,,,,,,,,,,,,,,,1
5377462,1995,08/095787,1993,1,0,0,1,1,,0,,,,,E,2,2,2,0,fl:mi_ln:beals-1,1,Michael Beals,uek71cmxt91deb13iivf8bmox,1,Brian Marine,,,,,,,,,,,,,,,,,,,,,,
5377463,1995,08/010654,1993,1,0,0,1,1,,0,,,,,E,1,1,1,0,fl:ia_ln:howe-1,1,Ian Howe,,,,,,,,,,,,,,,,,,,,,,,,,
5377464,1995,07/741709,1991,1,1,1,1,1,"OWENS CORNING FIBERGLAS TECHNOLOGY, INC.",0,US,Summit,IL,Cook,E,2,2,2,0,fl:ri_ln:mott-2,1,Richard A. Mott,fl:ri_ln:hite-1,1,Richard S. Hite,,,,,,,,,,,,,,,,,,,,,,0
5377465,1995,07/820887,1992,1,1,1,1,1,KAJIMA CORPORATION,0,JP,Tokyo,,,E,11,10,10,0,fl:ta_ln:kobori-5,1,Takuji Kobori,fl:sh_ln:ban-3,1,Shigeru Ban,fl:to_ln:kubota-4,1,Toshihiko Kubota,a2wkzeghffkylfe3tsy58c1s0,1,Osamu Nohira,fl:no_ln:koshika-1,1,Norihide Koshika,fl:ko_ln:kondo-13,,Koji Kondo,fl:sa_ln:masuda-11,1,Sadaaki Masuda,fl:yo_ln:kitamura-21,1,Yoshinori Kitamura,fl:hi_ln:tanaka-44,1,Hideo Tanaka,0
5377466,1995,07/891557,1992,1,1,1,1,1,"HAWORTH, INC.",0,US,Holland,MI,Ottawa County,E,2,2,2,0,fl:ro_ln:insalaco-1,1,Robert W. Insalaco,fl:ri_ln:haworth-1,1,Richard G. Haworth,,,,,,,,,,,,,,,,,,,,,,0
5377467,1995,07/958316,1992,1,0,0,1,1,,0,,,,,E,1,1,1,0,fl:ch_ln:barnavol-1,1,Charles Barnavol,,,,,,,,,,,,,,,,,,,,,,,,,
5377468,1995,08/053917,1993,1,1,1,1,1,HANOVER PREST-PAVING COMPANY,0,US,Hanover,PA,York,E,1,1,1,0,fl:jo_ln:repasky-1,1,John Michael Repasky,,,,,,,,,,,,,,,,,,,,,,,,,0
5377469,1995,08/086093,1993,1,0,0,1,1,,0,,,,,E,1,1,1,0,fl:re_ln:schmid-3,1,Rene Schmid,,,,,,,,,,,,,,,,,,,,,,,,,
5377470,1995,08/026477,1993,1,0,0,1,1,,0,,,,,E,1,1,1,0,fl:ca_ln:hebinck-1,1,Carl Hebinck,,,,,,,,,,,,,,,,,,,,,,,,,
5377471,1995,08/213947,1994,1,1,1,1,1,THE ROBBINS COMPANY,0,US,Cincinnati,OH,Hamilton,E,1,1,1,0,fl:mi_ln:niese-1,1,Michael W. Niese,,,,,,,,,,,,,,,,,,,,,,,,,0
5377472,1995,07/832014,1992,1,0,0,1,1,,0,,,,,E,1,1,1,0,fl:bo_ln:terenzoni-1,1,Bob Terenzoni,,,,,,,,,,,,,,,,,,,,,,,,,
5377473,1995,07/714322,1991,1,1,1,1,1,CARDINAL CG COMPANY,0,US,Gaylord,MI,Otsego,E,2,2,2,0,fl:ni_ln:narayan-3,1,Nilabh Narayan,fl:ja_ln:larsen-13,1,James E. Larsen,,,,,,,,,,,,,,,,,,,,,,0
5377474,1995,07/969342,1992,1,1,1,1,1,HAYSSEN MANUFACTURING COMPANY,0,US,Sheboygan,WI,Sheboygan,B,3,3,3,0,fl:ll_ln:kovacs-1,1,Lloyd Kovacs,fl:da_ln:cherney-2,1,Dale M. Cherney,fl:ke_ln:hopkins-3,1,Keith W. Hopkins,,,,,,,,,,,,,,,,,,,0
5377475,1995,08/070839,1993,1,1,1,1,1,ROBERT BOSCH GMBH,0,DE,Stuttgart,,,B,3,3,3,0,fl:ro_ln:haarer-1,1,Rolf Haarer,fl:wo_ln:schmitt-1,1,Wolfgang Schmitt,fl:th_ln:moser-8,1,Theodor Moser,,,,,,,,,,,,,,,,,,,0
5377476,1995,07/969292,1993,1,1,1,1,1,INTERNATIONAL BUSINESS MACHINES CORPORATION,0,US,Armonk,NY,Westchester,B H,5,5,4,1,fl:gu_ln:bohmer-1,0,Gudrun Bohmer,fl:jo_ln:gentischer-2,1,Josef Gentischer,fl:ro_ln:lehner-3,1,Rolf Lehner,fl:di_ln:modjesch-1,1,Dieter Modjesch,fl:wo_ln:schmutz-1,1,Wolfgang Schmutz,,,,,,,,,,,,,0
5377477,1995,08/164450,1993,1,1,1,1,1,SIGNODE CORPORATION,0,US,Glenview,IL,Cook,B,2,2,2,0,fl:ja_ln:haberstroh-1,1,James A. Haberstroh,fl:ti_ln:pearson-7,1,Timothy B. Pearson,,,,,,,,,,,,,,,,,,,,,,0
5377478,1995,08/068212,1993,1,1,1,1,1,HAYSSEN MANUFACTURING COMPANY,0,US,Sheboygan,WI,Sheboygan,B,2,2,2,0,fl:ll_ln:kovacs-1,1,Lloyd Kovacs,fl:ma_ln:tosetti-1,1,Mario Tosetti,,,,,,,,,,,,,,,,,,,,,,0
5377479,1995,08/090209,1993,1,0,0,1,1,,0,,,,,A B,2,2,2,0,fl:ra_ln:wilstrand-1,1,Ragnar Wilstrand,fl:ma_ln:wilstrand-1,1,Mats Wilstrand,,,,,,,,,,,,,,,,,,,,,,
5377480,1995,08/107700,1993,1,0,0,1,1,,0,,,,,A,1,1,1,0,fl:ha_ln:locher-1,1,Hans Locher,,,,,,,,,,,,,,,,,,,,,,,,,
5377481,1995,08/032645,1993,1,0,0,1,1,,0,,,,,A,2,2,2,0,fl:du_ln:sibley-1,1,Duane Sibley,fl:dw_ln:sibley-1,1,Dwight A. Sibley,,,,,,,,,,,,,,,,,,,,,,
5377482,1995,08/116326,1993,1,1,1,1,1,"MILLER-ST. NAZIANZ, INC.",0,US,Kiel,WI,Manitowoc County,A,1,1,1,0,fl:wa_ln:knigge-1,1,Walter N. Knigge,,,,,,,,,,,,,,,,,,,,,,,,,0
5377483,1995,08/178848,1994,1,0,0,1,1,,0,,,,,F,1,1,1,0,fl:r._ln:mowill-1,1,R. Jan Mowill,,,,,,,,,,,,,,,,,,,,,,,,,
5377484,1995,08/149805,1993,1,1,1,1,1,TOYOTA JIDOSHA KABUSHIKI KAISHA,0,MH,Ebeye,,,F,1,1,1,0,fl:ya_ln:shimizu-32,1,Yasuhiro Shimizu,,,,,,,,,,,,,,,,,,,,,,,,,0
5377485,1995,07/938269,1992,1,1,1,1,1,HYDRO ENERGY ASSOCIATES LIMITED,0,GB,Gloucester,,,F H,1,1,1,0,fl:no_ln:bellamy-1,1,Norman W. Bellamy,,,,,,,,,,,,,,,,,,,,,,,,,0
5377486,1995,08/061466,1993,1,1,1,1,1,FORD MOTOR COMPANY,0,US,Dearborn,MI,Wayne,F,3,3,2,1,fl:ha_ln:servati-1,1,Hamid B. Servati,fl:st_ln:darr-3,1,Steven T. Darr,fl:ma_ln:furness-1,0,Mary Beth Furness,,,,,,,,,,,,,,,,,,,0
5377487,1995,08/087076,1993,1,1,1,1,1,"KANZAKI KOKYUKOKI MFG. CO., LTD.",0,JP,Kasai,,,F,2,2,2,0,fl:to_ln:azuma-19,1,Toshiro Azuma,fl:hi_ln:okada-65,1,Hideaki Okada,,,,,,,,,,,,,,,,,,,,,,0
5377488,1995,08/084975,1993,1,1,1,1,1,TOX PRESSOTECHNIK GMBH & CO. KG,0,DE,Weingarten,,,F,1,1,1,0,fl:vi_ln:malina-1,1,Viktor Malina,,,,,,,,,,,,,,,,,,,,,,,,,0
5377489,1995,07/930112,1992,1,1,1,1,1,WESTINGHOUSE ELECTRIC CORP.,0,US,Pittsburgh,PA,Allegheny,F,2,2,2,0,fl:ge_ln:silvestri-2,1,"George J. Silvestri, Jr.",fl:pa_ln:viscovich-1,1,Paul W. Viscovich,,,,,,,,,,,,,,,,,,,,,,0
5377490,1995,08/192025,1994,1,1,1,1,1,"AIR PRODUCTS AND CHEMICALS, INC.",0,US,Allentown,PA,Lehigh,F,2,2,2,0,fl:le_ln:howard-7,1,Lee J. Howard,fl:ho_ln:rowles-1,1,Howard C. Rowles,,,,,,,,,,,,,,,,,,,,,,0
5377491,1995,07/989392,1992,1,1,1,1,1,"PRAXAIR TECHNOLOGY, INC.",0,US,Danbury,CT,Fairfield,C F,1,1,1,0,fl:th_ln:schulte-1,1,Thomas R. Schulte,,,,,,,,,,,,,,,,,,,,,,,,,0
5377492,1995,08/176964,1994,1,1,1,1,1,THE LAITRAM CORPORATION,0,US,Harahan,LA,Jefferson,F,2,2,2,0,fl:th_ln:robertson-9,1,Thomas Robertson,fl:da_ln:johnson-110,1,David A. Johnson,,,,,,,,,,,,,,,,,,,,,,0
5377493,1995,08/219583,1994,1,1,1,1,1,THERMO KING CORPORATION,0,US,Minneapolis,MN,Hennepin,F,1,1,1,0,fl:an_ln:friedland-1,1,Anthony E. Friedland,,,,,,,,,,,,,,,,,,,,,,,,,0
5377494,1995,07/903268,1992,1,1,1,1,1,SHARP KABUSHIKI KAISHA,0,JP,Osaka,,,F,3,3,3,0,fl:sh_ln:takagi-15,1,Shinya Takagi,fl:ka_ln:minato-7,1,Kazuaki Minato,fl:ma_ln:satomura-1,1,Masafumi Satomura,,,,,,,,,,,,,,,,,,,0
5377495,1995,08/266194,1994,1,0,0,1,1,,0,,,,,F,1,1,1,0,h8tuj7kzqqbncu5row8hoxdnm,1,Regis G. Daigle,,,,,,,,,,,,,,,,,,,,,,,,,
5377496,1995,08/131584,1993,1,1,1,1,1,CARRIER CORPORATION,0,US,Syracuse,NY,Onondaga,G,3,3,3,0,fl:na_ln:otto-3,1,Nancy M. Otto,fl:wa_ln:clough-1,1,Warren Clough,odz0akghpw2sor2zsfcpphmgf,1,Henry B. Balduzzi,,,,,,,,,,,,,,,,,,,0
5377497,1995,08/170526,1993,1,1,1,1,1,LENNOX INDUSTRIES INC.,0,US,Richardson,TX,Dallas County,G,1,1,0,1,fl:jo_ln:powell-53,0,Joe Powell,,,,,,,,,,,,,,,,,,,,,,,,,0
5377498,1995,08/101129,1993,1,1,1,1,1,WHIRLPOOL CORPORATION,0,US,Benton Harbor,MI,Berrien,F,3,3,3,0,fl:ni_ln:cur-1,1,Nihat O. Cur,fl:st_ln:kuehl-2,1,Steven J. Kuehl,fl:do_ln:leclear-1,1,Douglas D. Leclear,,,,,,,,,,,,,,,,,,,0
5377499,1995,08/240444,1994,1,1,1,1,1,"HUDSON TECHNOLOGIES, INC.",0,US,Hillburn,NY,Town of Ramapo,F,1,1,1,0,fl:ke_ln:zugibe-1,1,Kevin Zugibe,,,,,,,,,,,,,,,,,,,,,,,,,0
5377500,1995,08/070806,1993,1,1,1,1,1,"FAST MAKER ENTERPRISE CO., LTD.",0,TW,Luzhu District,,,F,1,1,1,0,fl:te_ln:yang-7,1,Ten S. Yang,,,,,,,,,,,,,,,,,,,,,,,,,0
5377501,1995,07/952894,1992,1,1,1,1,1,ENVIRONMENTAL PRODUCTS AMALGAMATED PTY. LTD.,0,AU,Elmore,,,F,1,1,1,0,fl:ro_ln:muston-1,1,Robert L. Muston,,,,,,,,,,,,,,,,,,,,,,,,,0
5377502,1995,08/174781,1993,1,0,0,1,1,,0,,,,,F,3,3,3,0,fl:ha_ln:collins-4,1,Harold O. Collins,fl:ja_ln:hennessy-2,1,James J. Hennessy,fl:gi_ln:mancillas-1,1,Gilbert Mancillas,,,,,,,,,,,,,,,,,,,
5377503,1995,08/108508,1993,1,1,1,1,1,"NORDYNE, INC.",0,US,Chesterfield,MO,St. Louis,F,2,2,1,1,fl:wa_ln:reedy-1,1,Wayne R. Reedy,fl:la_ln:boyce-3,0,Lawrence J. Boyce,,,,,,,,,,,,,,,,,,,,,,0