patent_number,grant_year,application_number,application_year,d_inventor,d_assignee,d_location,d_application,d_ipc,assignee,assignee_ind,country,city,state,county,ipc_section,team_size,inventors,men_inventors,women_inventors,inventor_id1,male_flag1,inventor_name1,inventor_id2,male_flag2,inventor_name2,inventor_id3,male_flag3,inventor_name3,inventor_id4,male_flag4,inventor_name4,inventor_id5,male_flag5,inventor_name5,inventor_id6,male_flag6,inventor_name6,inventor_id7,male_flag7,inventor_name7,inventor_id8,male_flag8,inventor_name8,inventor_id9,male_flag9,inventor_name9,assignee_sequence
6334220,2002,09/351659,1999,1,0,0,1,1,,0,,,,,A,1,1,1,0,fl:gr_ln:frye-3,1,Greg Frye,,,,,,,,,,,,,,,,,,,,,,,,,
6334221,2002,09/381981,1999,1,0,0,1,1,,0,,,,,A,1,1,1,0,fl:st_ln:hope-5,1,Stephen Ross Hope,,,,,,,,,,,,,,,,,,,,,,,,,
6334222,2002,09/635580,2000,1,1,1,1,1,SANXING SUN,1,US,,KS,Decatur County,A,1,1,0,1,fl:sa_ln:sun-17,0,Sanxing Sun,,,,,,,,,,,,,,,,,,,,,,,,,0
6334223,2002,09/675537,2000,1,0,0,1,1,,0,,,,,A,1,1,1,0,5jbtspjer4jggzd92czizmvf6,1,John A. Pieri,,,,,,,,,,,,,,,,,,,,,,,,,
6334224,2002,09/458592,1999,1,1,1,1,1,"HYDRABATHS, INC.",0,US,Santa Ana,CA,Orange,A,2,2,2,0,fl:ph_ln:chalberg-1,1,Philip E. Chalberg,fl:ki_ln:marks-1,1,Kipley Roydon Marks,,,,,,,,,,,,,,,,,,,,,,0
6334225,2002,09/618727,2000,1,0,0,1,1,,0,,,,,A,1,1,1,0,oad3qjjykr2ibp5qtv4oe0gg9,1,Gary Brinkmann,,,,,,,,,,,,,,,,,,,,,,,,,
6334226,2002,09/529968,2000,1,1,1,1,1,THE TORO COMPANY,0,JP,Fukuoka,,,E,3,3,3,0,fl:os_ln:tokunaga-1,1,Osamu Tokunaga,fl:hi_ln:hasebe-2,1,Hideyuki Hasebe,fl:si_ln:inada-1,1,Sigemiti Inada,,,,,,,,,,,,,,,,,,,0
6334227,2002,09/222636,1998,1,1,1,1,1,ROSET S.A.,0,FR,,,,A,1,1,0,1,fl:so_ln:larger-1,0,Sophie Larger,,,,,,,,,,,,,,,,,,,,,,,,,0
6334228,2002,09/411783,1999,1,1,1,1,1,"HALO INNOVATIONS, INC.",0,US,Plymouth,MN,Hennepin,A,1,1,1,0,fl:wi_ln:schmid-2,1,William R. Schmid,,,,,,,,,,,,,,,,,,,,,,,,,0
6334229,2002,09/227272,1999,1,1,1,1,1,LAM RESEARCH CORPORATION,0,US,Fremont,CA,Alameda,B,9,9,6,3,fl:ma_ln:moinpour-2,1,Mansour Moinpour,fl:ho_ln:nguyen-17,0,Hoang T. Nguyen,fl:mo_ln:salek-1,1,Mohsen Salek,fl:yo_ln:park-123,0,Young C. Park,fl:to_ln:bramblett-1,1,Tom Bramblett,fl:jo_ln:delarios-1,1,John deLarios,fl:ly_ln:ryle-1,0,Lynn Ryle,fl:do_ln:anderson-24,1,Donald Anderson,fl:wi_ln:krusell-2,1,Wilbur C. Krusell,0
6334230,2002,09/758989,2001,1,1,1,1,1,INTERNATIONAL BUSINESS MACHINES CORPORATION,0,US,Armonk,NY,Westchester,B,3,3,3,0,fl:ra_ln:khoury-1,1,Raymond M. Khoury,fl:ma_ln:mattaroccia-1,1,Marc Mattaroccia,fl:jo_ln:ocasio-1,1,Jose M. Ocasio,,,,,,,,,,,,,,,,,,,0
6334231,2002,09/803056,2001,1,0,0,1,1,,0,,,,,A,1,1,1,0,fl:er_ln:safieh-1,1,Eric Safieh,,,,,,,,,,,,,,,,,,,,,,,,,
6334232,2002,09/609252,2000,1,0,0,1,1,,0,,,,,A,1,1,1,0,fl:ma_ln:sato-69,1,Masanori Sato,,,,,,,,,,,,,,,,,,,,,,,,,
6334233,2002,09/475935,1999,1,1,1,1,1,"BISSELL HOMECARE, INC.",0,US,Grand Rapids,MI,Kent,A,2,2,2,0,fl:ke_ln:roberts-9,1,Kenneth L. Roberts,fl:ga_ln:steinberg-2,1,Gary L. Steinberg,,,,,,,,,,,,,,,,,,,,,,0
6334234,2002,09/239860,1999,1,1,1,1,1,FANTOM TECHNOLOGIES INC.,0,CA,Welland,ON,,A,2,2,2,0,fl:wa_ln:conrad-2,1,Wayne Ernest Conrad,fl:he_ln:conrad-4,1,Helmut Gerhard Conrad,,,,,,,,,,,,,,,,,,,,,,0
6334235,2002,09/297095,1999,1,1,1,1,1,ELECTRONIQUE MARCEL DASSAULT,0,FR,Paris,,,E,3,3,3,0,fl:be_ln:duperray-1,1,Bernard Duperray,fl:al_ln:donzier-1,1,Alain Donzier,fl:ja_ln:sicre-1,1,Jacques Sicre,,,,,,,,,,,,,,,,,,,1
6334236,2002,09/466878,1999,1,1,1,1,1,MULTIMATIC INC.,0,CA,Schreiber,ON,,E,1,1,1,0,fl:er_ln:kalliomaki-1,1,Eric V. Kalliomaki,,,,,,,,,,,,,,,,,,,,,,,,,0
6334237,2002,09/544389,2000,1,1,1,1,1,KITI INTERNATIONAL CORPORATION,0,US,Greenville,SC,Greenville,D,1,1,0,1,fl:ki_ln:tsuzuki-4,0,Kiyohiro Tsuzuki,,,,,,,,,,,,,,,,,,,,,,,,,0
6334238,2002,09/734038,2000,1,1,1,1,1,TRüTZSCHLER GMBH & CO. KG,0,DE,Rheydt,,,D,1,1,1,0,fl:re_ln:hartung-1,1,Reinhard Hartung,,,,,,,,,,,,,,,,,,,,,,,,,0
6334239,2002,09/625665,2000,1,0,0,1,1,,0,,,,,A,1,1,1,0,fl:he_ln:kraut-1,1,Herman H. Kraut,,,,,,,,,,,,,,,,,,,,,,,,,
6334240,2002,09/572333,2000,1,0,0,1,1,,0,,,,,A,1,1,0,1,fl:yi_ln:li-220,0,Ying Li,,,,,,,,,,,,,,,,,,,,,,,,,
6334241,2002,09/485008,2000,1,0,0,1,1,,0,,,,,B,1,1,1,0,b6o35gid6y9ec2ngq7tj6ny3j,1,Yngve Flodin,,,,,,,,,,,,,,,,,,,,,,,,,
6334242,2002,09/536630,2000,1,1,1,1,1,SIEMENS VDO AUTOMOTIVE CORPORATION,0,US,Auburn Hills,MI,Oakland,F,2,2,2,0,fl:jo_ln:scollard-1,1,Joseph Edward Scollard,fl:st_ln:bugos-1,1,Stephen C. Bugos,,,,,,,,,,,,,,,,,,,,,,0
6334243,2002,09/897957,2001,1,1,1,1,1,HAUNI MASCHINENBAU AG,0,DE,Hamburg,,,D,1,1,0,1,fl:st_ln:wolff-4,0,Stephan Wolff,,,,,,,,,,,,,,,,,,,,,,,,,0
6334244,2002,09/295579,1999,1,1,1,1,1,SEIKO EPSON CORPORATION,0,JP,Tokyo,,,H,1,1,1,0,fl:ts_ln:hashizume-3,1,Tsutomu Hashizume,,,,,,,,,,,,,,,,,,,,,,,,,0
6334245,2002,09/854529,2001,1,1,1,1,1,"DAICEL CHEMICAL INDUSTRIES, LTD.",0,JP,Osaka,,,B,2,2,1,1,fl:no_ln:katsuda-1,1,Nobuyuki Katsuda,fl:sh_ln:tomiyama-6,0,Shogo Tomiyama,,,,,,,,,,,,,,,,,,,,,,0
6334246,2002,09/285790,1999,1,1,1,1,1,ATTREZZERIA M.V. DI MARIN VISINO E C. S.N.C.,0,IT,Casalmaggiore,,,B,1,0,0,0,fl:vi_ln:marin-3,,Visino Marin,,,,,,,,,,,,,,,,,,,,,,,,,0
6334247,2002,08/872519,1997,1,1,1,1,1,INTERNATIONAL BUSINESS MACHINES CORPORATION,0,US,Armonk,NY,Westchester,H,6,5,5,0,fl:br_ln:beaman-3,1,Brian S. Beaman,fl:ke_ln:fogel-3,1,Keith E. Fogel,fl:pa_ln:lauro-1,1,Paul A. Lauro,fl:ma_ln:norcott-1,1,Maurice Heathcote Norcott,fl:da_ln:shih-2,,Da-Yuan Shih,fl:ge_ln:walker-8,1,George F. Walker,,,,,,,,,,0
6334248,2002,08/784752,1997,1,1,1,1,1,"TOTAL REGISTER, INC.",0,US,Brookfield,CT,Fairfield County,H,1,1,1,0,fl:te_ln:gallagher-1,1,Terence J. Gallagher,,,,,,,,,,,,,,,,,,,,,,,,,0
6334249,2002,09/064492,1998,1,1,1,1,1,TEXAS INSTRUMENTS INCORPORATED,0,US,Dallas,TX,Dallas County,H,1,1,0,1,fl:we_ln:hsu-48,0,Wei-Yung Hsu,,,,,,,,,,,,,,,,,,,,,,,,,0
6334250,2002,09/376951,1999,1,1,0,1,1,"FUNAI ELECTRIC CO., LTD.",0,,,,,H,2,2,2,0,fl:os_ln:maeda-1,1,Osamu Maeda,fl:ku_ln:sawai-1,1,Kunio Sawai,,,,,,,,,,,,,,,,,,,,,,0
6334251,2002,09/438661,1999,1,1,1,1,1,YAZAKI CORPORATION,0,JP,Tokyo,,,H,1,0,0,0,fl:te_ln:ide-4,,Tetsuro Ide,,,,,,,,,,,,,,,,,,,,,,,,,0
6334252,2002,09/458692,1999,1,1,1,1,1,"NISSAN MOTOR CO., LTD.",0,JP,Yokohama,,,B,8,7,7,0,fl:ma_ln:sato-22,1,Manabu Sato,fl:ma_ln:takiguchi-2,1,Masato Takiguchi,fl:ko_ln:sato-11,,Kouji Sato,fl:ko_ln:ohira-2,1,Kouichi Ohira,fl:ma_ln:tashiro-5,1,Masami Tashiro,fl:ta_ln:matsuoka-14,1,Takashi Matsuoka,fl:ta_ln:tajima-8,1,Takamitsu Tajima,fl:ke_ln:kanamori-1,1,Kenji Kanamori,,,,0
6334253,2002,09/648478,2000,1,0,0,1,1,,0,,,,,H,1,1,0,1,fl:yi_ln:cheng-79,0,Yin-Ho Cheng,,,,,,,,,,,,,,,,,,,,,,,,,
6334254,2002,09/363008,1999,1,1,1,1,1,AMERICAN SAFETY RAZOR COMPANY,0,US,Verona,VA,Augusta,B,1,1,1,0,fl:je_ln:wonderley-1,1,Jeffrey W. Wonderley,,,,,,,,,,,,,,,,,,,,,,,,,0
6334255,2002,09/558548,2000,1,0,0,1,1,,0,,,,,B,1,1,0,1,fl:ch_ln:chang-866,0,Chih-Min Chang,,,,,,,,,,,,,,,,,,,,,,,,,
6334256,2002,09/524507,2000,1,1,1,1,1,KUM LIMITED,0,IE,Dublin,,,B,1,1,1,0,fl:fr_ln:luttgens-1,1,Fritz Luttgens,,,,,,,,,,,,,,,,,,,,,,,,,0
6334257,2002,09/424952,2000,1,1,1,1,1,ERASMUS UNIVERSITEIT ROTTERDAM INSTITUUT REVALIDATIEGENEESKUNDE VAN DE FACULTEIT GENEESKUNDE-EN GEZONDHEIDSWETENSCHAPPEN,0,NL,Rotterdam,,,G,1,1,1,0,fl:ar_ln:denouden-1,1,Arie Den Ouden,,,,,,,,,,,,,,,,,,,,,,,,,0
6334258,2002,09/467877,1999,1,1,1,1,1,"MOSEL VITELIC, INC.",0,TW,,,,G,4,4,4,0,fl:ch_ln:lee-613,1,Chun-Chieh Lee,fl:hu_ln:tseng-37,1,Hua-Jen Tseng,fl:do_ln:tsai-3,1,Dong-Tay Tsai,fl:yi_ln:chin-11,1,Yi-Hua Chin,,,,,,,,,,,,,,,,0
6334259,2002,09/593700,2000,1,0,0,1,1,,0,,,,,B,1,1,1,0,fl:ba_ln:harvey-3,1,Barry Harvey,,,,,,,,,,,,,,,,,,,,,,,,,
6334260,2002,09/514290,2000,1,1,1,1,1,ROCK MECHANICS TECHNOLOGY LIMITED,0,GB,Swansea,,,E,2,2,2,0,fl:al_ln:bloor-1,1,Alan Stuart Bloor,fl:pa_ln:fletcher-11,1,Paul Fletcher,,,,,,,,,,,,,,,,,,,,,,0
6334261,2002,09/421524,1999,1,1,1,1,1,THE STANLEY WORKS,0,US,Meridian Avenue,CT,Hartford,B,2,2,2,0,fl:ro_ln:scillia-1,1,Robert Scillia,fl:ro_ln:owens-14,1,Robert L. Owens,,,,,,,,,,,,,,,,,,,,,,0
6334262,2002,09/062982,2000,1,0,0,1,1,,0,,,,,G,1,1,1,0,fl:ro_ln:ferrand-1,1,Robert J. Ferrand,,,,,,,,,,,,,,,,,,,,,,,,,
6334263,2002,09/182633,1998,1,1,1,1,1,"SPICER TECHNOLOGY, INC.",0,US,Warsaw,IN,Kosciusko,G,2,2,2,0,ekxe7hutlugh0coz3wg2dwln0,1,Michael L. Frane,00fnwifdxpobh45bm6059w979,1,John H. Urick,,,,,,,,,,,,,,,,,,,,,,0
6334264,2002,09/474803,1999,1,1,1,1,1,HYUNDAI MOTOR COMPANY,0,KR,Seoul,,,G,1,1,0,1,fl:jo_ln:oh-109,0,Joo Tae Oh,,,,,,,,,,,,,,,,,,,,,,,,,0
6334265,2002,09/578201,2000,1,1,1,1,1,APPLIKATIONS-UND TECHNIKZENTRUM FUR ENERGIEVERFAHRENS-UMWELT UND STROMUNGSTECHNIK,0,DE,Sulzbach-Rosenberg,,,F,3,3,3,0,fl:an_ln:emmel-1,1,Andres Emmel,fl:dr_ln:stevanovic-1,1,Dragan Stevanovic,fl:ha_ln:fassbinder-1,1,Hans-Georg Fassbinder,,,,,,,,,,,,,,,,,,,0
6334266,2002,09/665932,2000,1,1,1,1,1,"S.C. FLUIDS, INC.",0,US,Nashua,NH,Hillsborough,F,5,5,5,0,fl:he_ln:moritz-1,1,Heiko Moritz,fl:jo_ln:talbott-4,1,Jonathan A. Talbott,fl:mo_ln:chandra-1,1,Mohan Chandra,fl:ja_ln:tseronis-1,1,James A. Tseronis,fl:ij_ln:jafri-1,1,Ijaz Jafri,,,,,,,,,,,,,0
6334267,2002,09/692819,2000,1,1,1,1,1,AMERICAN DRYER CORPORATION,0,US,Fall River,MA,Bristol,F,1,1,1,0,fl:de_ln:slutsky-1,1,Dennis Slutsky,,,,,,,,,,,,,,,,,,,,,,,,,0
6334268,2002,09/589453,2000,1,1,1,1,1,TDK CORPORATION,0,JP,Tokyo,,,B,2,2,1,1,fl:ma_ln:ikebe-3,1,Masaru Ikebe,fl:yu_ln:miyazaki-12,0,Yukio Miyazaki,,,,,,,,,,,,,,,,,,,,,,0
6334269,2002,09/286122,1999,1,1,1,1,1,"WARN INDUSTRIES, INC.",0,US,Milwaukie,OR,Clackamas County,E,1,1,1,0,fl:je_ln:dilks-1,1,Jerry L. Dilks,,,,,,,,,,,,,,,,,,,,,,,,,0
6334270,2002,09/814297,2001,1,0,0,1,1,,0,,,,,G,1,1,1,0,fl:fu_ln:ko-4,1,Fu-Chung Ko,,,,,,,,,,,,,,,,,,,,,,,,,
6334271,2002,09/552594,2000,1,1,1,1,1,"WEA BOR CO., LTD.",0,TW,Tainan,,,G,1,1,1,0,jh074kc4u11uvz3owpjvazmo1,1,Mel-Fen Su Yeh,,,,,,,,,,,,,,,,,,,,,,,,,0
6334272,2002,08/811192,1997,1,1,1,1,1,"DAIWA SEIKO, INC.",0,JP,Tokyo,,,A,5,4,4,0,fl:ma_ln:akiba-4,1,Masaru Akiba,fl:ma_ln:nakagawa-29,,Masayuki Nakagawa,fl:to_ln:tsurufuji-1,1,Tomoyoshi Tsurufuji,fl:sh_ln:sunaga-2,1,Shunji Sunaga,fl:ko_ln:ito-27,1,Koichi Ito,,,,,,,,,,,,,0
6334273,2002,09/202447,1998,1,1,1,1,1,JEFFREY TURNER,1,AU,Fawn Drive,,,A,2,2,2,0,fl:je_ln:turner-21,1,Jeffrey Turner,fl:ja_ln:turner-33,1,James Turner,,,,,,,,,,,,,,,,,,,,,,0
6334274,2002,09/372670,1999,1,1,1,1,1,KABUSHIKI KAISHA TOSHIBA,0,JP,Tochigi,,,A,3,3,3,0,fl:sa_ln:inoue-13,1,Sadayuki Inoue,fl:su_ln:ayusawa-1,1,Sumio Ayusawa,fl:ka_ln:eda-1,1,Katsumasa Eda,,,,,,,,,,,,,,,,,,,0
6334275,2002,08/874380,1997,1,1,1,1,1,CARCO DEVELOPMENT COMPANY,0,US,Bakersfield,CA,Kern,A,1,1,1,0,fl:mi_ln:egan-8,1,Michael Egan,,,,,,,,,,,,,,,,,,,,,,,,,0
6334276,2002,09/414086,1999,1,1,1,1,1,LABINAL,0,FR,,,,E,2,1,1,0,fl:th_ln:marinmartinod-2,1,Thierry Marin-Martinod,fl:ma_ln:du-7,,Marc Quenerch Du,,,,,,,,,,,,,,,,,,,,,,0
6334277,2002,09/460619,1999,1,1,1,1,1,"AMERIMAX BUILDING PRODUCTS, INC.",0,US,,KS,Decatur County,E,1,1,1,0,fl:je_ln:condino-2,1,Jeffrey M Condino,,,,,,,,,,,,,,,,,,,,,,,,,0
6334278,2002,09/561436,2000,1,1,1,1,1,STEELCO INCORPRORATED,0,US,Daytona Beach,FL,Volusia,E,1,1,1,0,fl:fl_ln:arnold-1,1,Floyd Arnold,,,,,,,,,,,,,,,,,,,,,,,,,0
6334279,2002,09/186102,1998,1,0,0,1,1,,0,,,,,E,2,1,1,0,fl:ja_ln:oliver-26,1,James Oliver,fl:ev_ln:oliver-2,,Evon L. Oliver,,,,,,,,,,,,,,,,,,,,,,
6334280,2002,09/125069,1998,1,1,1,1,1,BPB PLC,0,GB,Slough,,,E,5,4,4,0,88uil9cdvwo98t7np9t01xg1q,1,Etienne Frappart,fl:da_ln:townsend-12,1,David Townsend,fl:wi_ln:mcmillan-4,1,William J. McMillan,fl:ut_ln:joshi-2,,Utkarsha Joshi,fl:wi_ln:devereux-4,1,William Bell Devereux,,,,,,,,,,,,,0
6334281,2002,09/659007,2000,1,0,0,1,1,,0,,,,,E,2,1,1,0,fl:ja_ln:oliver-26,1,James Oliver,fl:ev_ln:oliver-2,,Evon L. Oliver,,,,,,,,,,,,,,,,,,,,,,
6334282,2002,09/836301,2001,1,0,0,1,1,,0,,,,,E,1,1,1,0,fl:he_ln:wood-3,1,Herman C. Wood,,,,,,,,,,,,,,,,,,,,,,,,,
6334283,2002,09/666079,2000,1,1,1,1,1,ROYAL GROUP TECHNOLOGIES LIMITED,0,CA,Vaughan,ON,,E,1,1,1,0,fl:ro_ln:edger-3,1,Ronald Fredrick Edger,,,,,,,,,,,,,,,,,,,,,,,,,0
6334284,2002,09/276666,1999,1,0,0,1,1,,0,,,,,E,1,1,1,0,fl:an_ln:provitola-1,1,Anthony Italo Provitola,,,,,,,,,,,,,,,,,,,,,,,,,
6334285,2002,09/389771,1999,1,1,1,1,1,"AUTOMATIC FIRE CONTROL, INCORPORATED",0,US,South El Monte,CA,Los Angeles,E,1,1,1,0,fl:kr_ln:kirschner-1,1,Kraig A. Kirschner,,,,,,,,,,,,,,,,,,,,,,,,,0
6334286,2002,09/572726,2000,1,0,0,1,1,,0,,,,,B,2,2,2,0,fl:se_ln:zambelli-1,1,Sergio Zambelli,fl:be_ln:zambelli-1,1,Benito Zambelli,,,,,,,,,,,,,,,,,,,,,,
6334287,2002,09/678636,2000,1,0,0,1,1,,0,,,,,E,1,1,0,1,fl:th_ln:fick-3,0,Theodore Fick,,,,,,,,,,,,,,,,,,,,,,,,,
6334288,2002,09/381413,1999,1,1,1,1,1,I.M.A. INDUSTRIA MACCHINE AUTOMATICHE S.P.A.,0,IT,Bologna,,,B,2,2,2,0,fl:al_ln:amaranti-1,1,Alessandro Amaranti,fl:al_ln:alessandri-1,1,Alessandro Alessandri,,,,,,,,,,,,,,,,,,,,,,0
6334289,2002,09/787529,2001,1,1,1,1,1,TETRA PAK PLASTICS LIMITED,0,CH,Geneva,,,B,1,1,1,0,fl:ha_ln:buchel-1,1,Hans-Heiner Büchel,,,,,,,,,,,,,,,,,,,,,,,,,0
6334290,2002,09/551207,2000,1,1,1,1,1,ROBERT BOSCH GMBH,0,DE,Stuttgart,,,B,2,2,2,0,fl:ma_ln:reichert-8,1,Manfred Reichert,fl:ma_ln:weinmann-3,1,Martin Weinmann,,,,,,,,,,,,,,,,,,,,,,0
6334291,2002,09/473700,1999,1,1,1,1,1,"UTBK, INC.",0,FR,Bischwiller,,,B,1,1,1,0,fl:pa_ln:lelievre-2,1,Patrick Lelievre,,,,,,,,,,,,,,,,,,,,,,,,,0
6334292,2002,09/573831,2000,1,1,1,1,1,KUHN S.A.,0,FR,Saverne,,,A,2,2,2,0,fl:ma_ln:walch-5,1,Martin Walch,fl:be_ln:wattron-1,1,Bernard Wattron,,,,,,,,,,,,,,,,,,,,,,0
6334293,2002,09/506800,2000,1,1,1,1,1,N.V. BEKAERT S.A.,0,BE,Zwevegem,,,D,3,2,2,0,ws6et2564k8im0bh46phe71zy,1,Horst Poethke,fl:st_ln:wostyn-1,1,Steven Wostyn,fl:st_ln:vanneste-4,,Stijn Vanneste,,,,,,,,,,,,,,,,,,,0
6334294,2002,09/571834,2000,1,1,1,1,1,GENERAL ELECTRIC COMPANY,0,US,Schenectady,NY,Schenectady County,F,2,2,2,0,fl:ke_ln:belsom-1,1,Keith Cletus Belsom,fl:ma_ln:wright-48,1,Marshalla Michelle Wright,,,,,,,,,,,,,,,,,,,,,,0
6334295,2002,09/726214,2000,1,1,1,1,1,GENERAL ELECTRIC COMPANY,0,US,Schenectady,NY,Schenectady County,F,3,2,2,0,fl:sa_ln:eldrid-1,,Sacheverel Quentin Eldrid,fl:sa_ln:salamah-1,1,Samir Armando Salamah,fl:th_ln:destefano-1,1,Thomas D. Destefano,,,,,,,,,,,,,,,,,,,0
6334296,2002,09/875328,2001,1,1,1,1,1,ALLIEDSIGNAL INC.,0,US,Morristown,NJ,Morris,F,3,3,3,0,fl:pa_ln:futa-1,1,"Paul W. Futa, Jr.",fl:st_ln:fisher-11,1,Steven F. Fisher,fl:ke_ln:sharp-10,1,Kevin R. Sharp,,,,,,,,,,,,,,,,,,,0
6334297,2002,09/624331,2000,1,1,1,1,1,ROLLS-ROYCE PLC,0,GB,London,,,F,3,3,3,0,fl:ge_ln:dailey-1,1,Geoffrey Dailey,fl:an_ln:pidcock-2,1,Anthony Pidcock,fl:de_ln:close-3,1,Desmond Close,,,,,,,,,,,,,,,,,,,0
6334298,2002,09/616258,2000,1,1,1,1,1,GENERAL ELECTRIC COMPANY,0,US,Cincinnati,OH,Hamilton,F,1,1,1,0,kmetnzynwwfljxmml4dz8kbvn,1,John Charles Aicholtz,,,,,,,,,,,,,,,,,,,,,,,,,0
6334299,2002,08/991949,1997,1,1,1,1,1,"RAMGEN POWER SYSTEMS, INC.",0,US,Bellevue,WA,King,F,1,1,1,0,fl:sh_ln:lawlor-2,1,Shawn P. Lawlor,,,,,,,,,,,,,,,,,,,,,,,,,0
6334300,2002,09/680468,2000,1,1,1,1,1,JEFFREY S. MELCHER,1,US,Bethesda,MD,Montgomery,F,1,1,1,0,fl:ja_ln:mehail-1,1,James J. Mehail,,,,,,,,,,,,,,,,,,,,,,,,,0
6334301,2002,09/257186,1999,1,1,1,1,1,VACCO INDUSTRIES,0,US,South El Monte,CA,Los Angeles,F,4,3,3,0,fl:be_ln:otsap-1,1,Ben A. Otsap,fl:jo_ln:cardin-1,1,Joseph M. Cardin,fl:an_ln:gonzalez-23,1,Antonio Gonzalez,fl:ke_ln:dyer-7,,Keith Dyer,,,,,,,,,,,,,,,,0
6334302,2002,09/351152,1999,1,1,1,1,1,THE UNITED STATES OF AMERICA AS REPRESENTED BY THE ADMINISTRATOR OF THE NATIONAL AERONAUTICS AND SPACE ADMINISTRATION,0,US,Washington,DC,District of Columbia,H,1,1,1,0,fl:fr_ln:changdiaz-1,1,Franklin R. Chang-Diaz,,,,,,,,,,,,,,,,,,,,,,,,,0
6334303,2002,09/367139,1999,1,1,1,1,1,VOLVO AERO CORPORATION,0,SE,carrer de Sertori,,,F,10,10,10,0,fl:jo_ln:berglund-1,1,Joakim Berglund,fl:ro_ln:borg-1,1,Ronald Borg,fl:je_ln:dahlin-1,1,Jens Dahlin,ay4gbh0so39bxt18biz4n4771,1,Peter Emvin,fl:st_ln:hansson-3,1,Stefan Hansson,fl:ol_ln:isaksson-2,1,Ola Isaksson,fl:pe_ln:ivarsson-2,1,Peter-Nemo Lorens Fredrik Ivarsson,fl:he_ln:johansson-4,1,Henrik Johansson,v9ttap5kfmdpbtn5h1pzj9mxz,1,Torbjörn Salomonson,0
6334304,2002,09/551170,2000,1,1,1,1,1,HONDA GIKEN KOGYO KABUSHIKI KAISHA,0,JP,Tokyo,,,F,4,3,3,0,fl:ke_ln:machida-7,,Kei Machida,fl:te_ln:endo-2,1,Tetsuo Endo,fl:sh_ln:takakura-8,1,Shiro Takakura,fl:yu_ln:yasui-8,1,Yuji Yasui,,,,,,,,,,,,,,,,0
6334305,2002,09/558171,2000,1,1,1,1,1,MAGNETI MARELLI S.P.A.,0,IT,Milano,,,F,2,2,2,0,fl:lu_ln:poggio-1,1,Luca Poggio,fl:ma_ln:secco-1,1,Marco Secco,,,,,,,,,,,,,,,,,,,,,,0
6334306,2002,09/321825,1999,1,1,1,1,1,"NISSAN MOTOR CO., LTD.",0,JP,Yokohama,,,F,3,1,1,0,fl:ko_ln:mori-16,1,Kouichi Mori,fl:ri_ln:sato-10,,Ritsuo Sato,fl:ki_ln:nishizawa-3,,Kimiyoshi Nishizawa,,,,,,,,,,,,,,,,,,,0
6334307,2002,09/629889,2000,1,1,1,1,1,ISUZU MOTORS LIMITED,0,JP,Tokyo,,,F,2,2,1,1,fl:no_ln:iwao-4,1,Nobuyuki Iwao,fl:ya_ln:yamamoto-20,0,Yasushi Yamamoto,,,,,,,,,,,,,,,,,,,,,,0
6334308,2002,09/261390,1999,1,1,1,1,1,KOMATSU LTD.,0,JP,Tokyo,,,F,3,2,2,0,fl:ya_ln:sato-33,1,Yasuhiro Sato,fl:ry_ln:wakisaka-1,,Ryoji Wakisaka,fl:no_ln:yoshida-31,1,Nobumi Yoshida,,,,,,,,,,,,,,,,,,,0
6334309,2002,09/579510,2000,1,1,1,1,1,NUOVO PIGNONE S.P.A.,0,IT,Firenze,,,F,3,3,2,1,fl:an_ln:dean-14,1,Anthony John Dean,fl:lu_ln:mei-1,0,Luciano Mei,fl:al_ln:miliani-1,1,Alessio Miliani,,,,,,,,,,,,,,,,,,,0
6334310,2002,09/586043,2000,1,1,1,1,1,GENERAL ELECTRIC COMPANY,0,US,Schenectady,NY,Schenectady County,F,3,3,3,0,fl:ma_ln:sutcu-1,1,Maz Sutcu,fl:be_ln:couture-2,1,Bernard Arthur Couture,fl:sa_ln:aslam-1,1,Sami Aslam,,,,,,,,,,,,,,,,,,,0
6334311,2002,09/511896,2000,1,1,1,1,1,"SAMSUNG ELECTRONICS CO., LTD.",0,KR,Suwon-si,,,F,4,1,0,1,fl:ta_ln:kim-196,,Tae Hoon Kim,fl:by_ln:kim-542,,Byung-Chul Kim,fl:yo_ln:lee-430,0,Young Woo Lee,fl:ta_ln:kim-424,,Tae Ryong Kim,,,,,,,,,,,,,,,,0
6334312,2002,09/667572,2000,1,1,1,1,1,LINDE AKTIENGESELLSCHAFT,0,DE,,,,F,3,3,3,0,fl:kl_ln:mack-1,1,Klaus Mack,fl:wi_ln:reese-2,1,Wilfried-Henning Reese,ps815tckb6kpjx69rcqs5ngit,1,Herbert Schimmer,,,,,,,,,,,,,,,,,,,0
6334313,2002,09/458695,1999,1,1,1,1,1,"SUMITOMO ELECTRIC INDUSTRIES, LTD.",0,JP,Osaka,,,F,2,1,1,0,fl:ta_ln:nagaishi-1,,Tatsuoki Nagaishi,fl:hi_ln:itozaki-2,1,Hideo Itozaki,,,,,,,,,,,,,,,,,,,,,,0
6334314,2002,09/646965,2000,1,0,0,1,1,,0,,,,,F,2,2,2,0,fl:an_ln:glazer-1,1,Anthony Michael Glazer,fl:jo_ln:cosier-1,1,John Cosier,,,,,,,,,,,,,,,,,,,,,,
6334315,2002,09/566506,2000,1,0,0,1,1,,0,,,,,F,1,1,1,0,fl:ig_ln:kotliar-1,1,Igor K. Kotliar,,,,,,,,,,,,,,,,,,,,,,,,,
6334316,2002,09/581819,2000,1,1,1,1,1,EBARA CORPORATION,0,JP,Tokyo,,,F,5,2,2,0,fl:ke_ln:maeda-28,,Kensaku Maeda,fl:yo_ln:fukasaku-1,1,Yoshiro Fukasaku,fl:hi_ln:inaba-20,1,Hideo Inaba,fl:to_ln:oouchi-6,,Toshiaki Oouchi,fl:ro_ln:nishida-3,,Rosuke Nishida,,,,,,,,,,,,,0
6334317,2002,09/456412,1999,1,1,1,1,1,SHARP KABUSHIKI KAISHA,0,JP,Osaka,,,F,2,2,2,0,qtrsjaa4uu0fpfz4tr29jy8tf,1,Tsukasa Bougauchi,fl:yu_ln:shimamura-7,1,Yuji Shimamura,,,,,,,,,,,,,,,,,,,,,,0
6334318,2002,09/410128,1999,1,1,1,1,1,"JAPAN SERVO CO., LTD.",0,JP,Shibukawa,,,F,7,6,5,1,fl:hi_ln:ando-39,,Hitoshi Ando,fl:ei_ln:kuroda-6,1,Eiji Kuroda,fl:at_ln:nakayama-1,0,Atsuo Nakayama,fl:ke_ln:yamane-3,1,Kentaro Yamane,fl:na_ln:toida-1,1,Naoko Toida,fl:ka_ln:yamashita-4,1,Kazufumi Yamashita,fl:ya_ln:niwa-5,1,Yasushi Niwa,,,,,,,0
6334319,2002,09/690850,2000,1,1,1,1,1,MAYTAG CORPORATION,0,US,Newton,IA,Jasper,F,1,1,1,0,fl:ku_ln:senner-1,1,Kurt C. Senner,,,,,,,,,,,,,,,,,,,,,,,,,0
6334320,2002,09/537539,2000,1,1,1,1,1,SPX CORPORATION,0,US,Muskegon,MI,Muskegon County,F,2,2,2,0,fl:wi_ln:brown-55,1,William Brown,2shb148shbksvzy8h6484fdwb,1,James P. Biedenharn,,,,,,,,,,,,,,,,,,,,,,0
6334321,2002,09/525348,2000,1,1,1,1,1,CARRIER CORPORATION,0,US,Farmington,CT,Hartford,F,3,2,2,0,fl:wa_ln:said-3,,Wahil Said,fl:jo_ln:ballet-1,1,Joseph Ballet,fl:sy_ln:douzet-1,1,Sylvain Douzet,,,,,,,,,,,,,,,,,,,0
6334322,2002,09/837485,2001,1,1,1,1,1,CALSONIC KANSEI CORPORATION,0,JP,Tokyo,,,F,4,4,4,0,fl:at_ln:kubota-7,1,Atsushi Kubota,fl:no_ln:ichimura-2,1,Nobuo Ichimura,fl:yo_ln:noda-12,1,Yoshitoshi Noda,fl:ka_ln:fujiura-3,1,Katsunori Fujiura,,,,,,,,,,,,,,,,0
6334323,2002,09/317055,1999,1,1,1,1,1,"KIDWELL ENVIRONMENTAL, LTD., INC.",0,US,Tulsa,OK,Tulsa County,F,1,1,1,0,fl:jo_ln:kidwell-4,1,John E. Kidwell,,,,,,,,,,,,,,,,,,,,,,,,,0
6334324,2002,09/743024,2001,1,1,1,1,1,ZEXEL VALEO CLIMATE CONTROL CORPORATION,0,JP,Saitama,,,F,4,4,4,0,fl:sh_ln:muta-2,1,Shunji Muta,fl:hi_ln:kanai-5,1,Hiroshi Kanai,fl:ke_ln:iijima-8,1,Kenji Iijima,fl:sh_ln:furuya-9,1,Shunichi Furuya,,,,,,,,,,,,,,,,0
6334325,2002,09/563530,2000,1,1,1,1,1,BAYERISCHE MOTOREN WERKE AKTIENGESELLSCHAFT,0,DE,Munich,,,B,2,2,2,0,q8b15d2eft5pvsmhf9xmwx4ou,1,Thomas Herpel,fl:st_ln:morgenstern-1,1,Stefan Morgenstern,,,,,,,,,,,,,,,,,,,,,,0
6334326,2002,09/585445,2000,1,1,1,1,1,LG ELECTRONICS INC.,0,KR,Seoul,,,F,2,2,1,1,fl:su_ln:kang-101,1,Sung-Hee Kang,fl:sa_ln:ha-23,0,Sam-Chul Ha,,,,,,,,,,,,,,,,,,,,,,0
6334327,2002,09/701660,2000,1,1,1,1,1,KABUSHIKI KAISHA PISTE SNOW INDUSTRIES,0,JP,Tokyo,,,F,1,0,0,0,fl:ta_ln:fujiwara-36,,Takamasa Fujiwara,,,,,,,,,,,,,,,,,,,,,,,,,1
6334328,2002,09/520390,2000,1,1,1,1,1,IMI CORNELIUS INC.,0,US,Anoka,MN,Anoka,F,1,1,1,0,fl:fr_ln:brill-1,1,Frank D. Brill,,,,,,,,,,,,,,,,,,,,,,,,,0
6334329,2002,09/591059,2000,1,0,0,1,1,,0,,,,,F,1,1,0,1,fl:su_ln:weller-3,0,Susan G. Weller,,,,,,,,,,,,,,,,,,,,,,,,,
6334330,2002,09/766961,2001,1,1,1,1,1,"PRAXAIR, INC.",0,US,Danbury,CT,Fairfield,F,3,3,2,1,fl:ga_ln:lang-10,0,Gary D. Lang,fl:th_ln:gasteyer-1,1,"Theodore Hall Gasteyer, III",fl:ye_ln:ho-4,1,Yeu-Chaun Simon Ho,,,,,,,,,,,,,,,,,,,0
6334331,2002,09/585191,2000,1,1,1,1,1,"TAIWAN SEMICONDUCTOR MANUFACTURING CO., LTD.",0,TW,Baoshan,,,F,2,2,2,0,fl:mi_ln:chen-296,1,Ming-Chung Chen,fl:mi_ln:lai-6,1,Min-Ter Lai,,,,,,,,,,,,,,,,,,,,,,0
6334332,2002,09/589363,2000,1,1,1,1,1,"MAYEKAWA MFG. CO., LTD.",0,JP,Tokyo,,,F,6,5,5,0,fl:ma_ln:yamamoto-64,1,Makoto Yamamoto,fl:yu_ln:hirano-7,1,Yukio Hirano,fl:se_ln:matsuda-1,1,Seiichiro Matsuda,fl:ya_ln:hirao-2,1,Yasuhiro Hirao,fl:ch_ln:yoshikawa-3,,Choiku Yoshikawa,fl:ka_ln:ito-5,1,Kazutoshi Ito,,,,,,,,,,0
6334333,2002,09/537509,2000,1,1,1,1,1,CALSONIC KANSEI CORPORATION,0,JP,Tokyo,,,F,1,1,1,0,fl:ma_ln:shinhama-1,1,Masayoshi Shinhama,,,,,,,,,,,,,,,,,,,,,,,,,0
6334334,2002,09/629089,2000,1,1,1,1,1,LINDE AKTIENGESELLSCHAFT,0,DE,Wiesbaden,,,F,8,8,8,0,fl:ru_ln:stockmann-1,1,Rudolf Stockmann,fl:ma_ln:bolt-4,1,Manfred Bolt,fl:ma_ln:steinbauer-2,1,Manfred Steinbauer,fl:ch_ln:pfeiffer-1,1,Christian Pfeiffer,fl:pe_ln:paurola-1,1,Pentti Paurola,fl:wo_ln:forg-1,1,Wolfgang Forg,fl:ar_ln:fredheim-1,1,Arne Olav Fredheim,fl:oy_ln:sorensen-1,1,Oystein Sorensen,,,,0
6334335,2002,08/841689,1997,1,1,1,1,1,HOYA CORPORATION,0,JP,Tokyo,,,C,3,3,3,0,fl:sh_ln:hirota-13,1,Shin-Ichiro Hirota,hhrfdp0xehb4vmyidgvdjm9lt,1,Jun Ichnose,fl:hi_ln:enomoto-5,1,Hiroshi Enomoto,,,,,,,,,,,,,,,,,,,0
6334336,2002,09/326543,1999,1,1,1,1,1,"ASAHI GLASS COMPANY, LIMITED",0,JP,Tokyo,,,C,6,5,5,0,fl:yu_ln:takei-4,1,Yusuke Takei,fl:mi_ln:sasaki-17,,Michito Sasaki,fl:ma_ln:matsuwaki-1,1,Masataka Matsuwaki,fl:sh_ln:inoue-16,1,Shigekuni Inoue,fl:at_ln:tanigaki-1,1,Atsushi Tanigaki,fl:mi_ln:sugimoto-14,1,Mitsuo Sugimoto,,,,,,,,,,0
6334337,2002,09/375805,1999,1,1,1,1,1,THEODORE A. LITOVITZ,1,US,Annapolis,MD,Anne Arundel,C,5,4,4,0,fl:pe_ln:macedo-1,1,Pedro B. Macedo,fl:ro_ln:mohr-3,,Robert K. Mohr,fl:ha_ln:hojaji-1,1,Hamid Hojaji,fl:ia_ln:pegg-1,1,Ian L. Pegg,fl:ma_ln:brandys-2,1,Marek Brandys,,,,,,,,,,,,,1
6334338,2002,09/109827,1998,1,1,1,1,1,LUCENT TECHNOLOGIES INC.,0,US,New Providence,NJ,Union,C,2,2,1,1,fl:ma_ln:mandich-1,0,Mary Louise Mandich,fl:wi_ln:reents-1,1,"William David Reents, Jr.",,,,,,,,,,,,,,,,,,,,,,0
6334339,2002,09/598893,2000,1,1,1,1,1,"THE FURUKAWA ELECTRIC CO., LTD.",0,JP,Tokyo,,,C,2,2,2,0,fl:ak_ln:kanao-1,1,Akihiro Kanao,fl:to_ln:mikami-11,1,Toshihiro Mikami,,,,,,,,,,,,,,,,,,,,,,0
6334340,2002,09/415906,1999,1,1,1,1,1,ALLIANCE LAUNDRY SYSTEMS LLC,0,US,Ripon,WI,Fond du Lac,D,3,3,3,0,fl:an_ln:kegler-1,1,Andrew Kegler,fl:gr_ln:malchow-2,1,Gregory L. Malchow,fl:st_ln:harris-30,1,Stephen L. Harris,,,,,,,,,,,,,,,,,,,0