patent_number,grant_year,application_number,application_year,d_inventor,d_assignee,d_location,d_application,d_ipc,assignee,assignee_ind,country,city,state,county,ipc_section,team_size,inventors,men_inventors,women_inventors,inventor_id1,male_flag1,inventor_name1,inventor_id2,male_flag2,inventor_name2,inventor_id3,male_flag3,inventor_name3,inventor_id4,male_flag4,inventor_name4,inventor_id5,male_flag5,inventor_name5,inventor_id6,male_flag6,inventor_name6,inventor_id7,male_flag7,inventor_name7,inventor_id8,male_flag8,inventor_name8,inventor_id9,male_flag9,inventor_name9,assignee_sequence
6502244,2003,10/003893,2001,1,1,1,1,1,HILLERICH & BRADSBY CO.,0,US,Louisville,KY,Jefferson,A,1,1,1,0,fl:ja_ln:kleinert-1,1,James M. Kleinert,,,,,,,,,,,,,,,,,,,,,,,,,0
6502245,2003,09/460598,1999,1,0,0,1,1,,0,,,,,A,1,1,1,0,fl:cr_ln:mcbride-1,1,Craig A. McBride,,,,,,,,,,,,,,,,,,,,,,,,,
6502246,2003,09/883408,2001,1,0,0,1,1,,0,,,,,A,1,1,1,0,fl:th_ln:porter-11,1,Thomas Porter,,,,,,,,,,,,,,,,,,,,,,,,,
6502247,2003,09/978591,2001,1,1,1,1,1,"GRAY MATTER HOLDINGS, LLC",0,US,Baltimore,MD,Baltimore city,A,2,2,2,0,fl:br_ln:legette-1,1,Brian E. Le Gette,fl:ju_ln:werner-2,1,Justin Saul Werner,,,,,,,,,,,,,,,,,,,,,,0
6502248,2003,09/986103,2001,1,1,1,1,1,"GRAY MATTER HOLDINGS, LLC",0,US,Baltimore,MD,Baltimore city,A,3,3,3,0,fl:br_ln:legette-2,1,Brian LeGette,fl:ju_ln:werner-2,1,Justin Saul Werner,fl:ro_ln:wilson-7,1,"Ronald L. Wilson, II",,,,,,,,,,,,,,,,,,,0
6502249,2003,09/972573,2001,1,1,1,1,1,VOUGHT CORPORATION,0,US,Dallas,TX,Dallas County,A,6,5,5,0,fl:cl_ln:cunningham-1,1,Clifton D. Cunningham,fl:ja_ln:fitch-7,1,James McKinnon Fitch,fl:ja_ln:howard-15,,James Jeffery Howard,fl:ja_ln:koesters-1,1,James P. Koesters,fl:mi_ln:leenhouts-1,1,Michael A. Leenhouts,fl:er_ln:moore-14,1,Eric Moore,,,,,,,,,,0
6502250,2003,09/812801,2001,1,1,1,1,1,UNI-CHARM CORPORATION,0,JP,Shikokuchuo,,,A,2,1,0,1,fl:ay_ln:suga-2,0,Ayami Suga,fl:mi_ln:wada-13,,Mitsuhiro Wada,,,,,,,,,,,,,,,,,,,,,,0
6502251,2003,09/830867,2001,1,1,1,1,1,THE TORO COMPANY,0,JP,Fukuoka,,,E,6,4,4,0,fl:ku_ln:teshima-1,1,Kunihiko Teshima,fl:ta_ln:kosugi-2,,Tatsuhiro Kosugi,fl:ta_ln:sugita-4,,Taiji Sugita,fl:ta_ln:ohtani-7,1,Takayuki Ohtani,fl:ke_ln:nagato-3,1,Kenichi Nagato,fl:yo_ln:suehiro-9,1,Yoshitaka Suehiro,,,,,,,,,,0
6502252,2003,09/936579,2001,1,0,0,1,1,,0,,,,,E,1,1,1,0,fl:he_ln:kang-3,1,Heung-Mook Kang,,,,,,,,,,,,,,,,,,,,,,,,,
6502253,2003,10/042800,2002,1,1,1,1,1,JACUZZI INC.,0,US,Walnut Creek,CA,Contra Costa,A,1,1,1,0,fl:ro_ln:olney-3,1,Robert Kent Olney,,,,,,,,,,,,,,,,,,,,,,,,,0
6502254,2003,09/693762,2000,1,1,1,1,1,"EWING COLE CHERRY BROTT, INC.",0,US,Philadelphia,PA,Philadelphia,A,1,1,1,0,3dujhce5gmcsfmub53tzmitmb,1,Quinn Anthony De Menna,,,,,,,,,,,,,,,,,,,,,,,,,0
6502255,2003,09/623701,2000,1,0,0,1,1,,0,,,,,A,2,2,2,0,fl:ma_ln:perkins-17,1,Mark R. Perkins,fl:br_ln:winkel-2,1,Brandon J. Winkel,,,,,,,,,,,,,,,,,,,,,,
6502256,2003,09/773714,2001,1,0,0,1,1,,0,,,,,A,3,3,3,0,fl:jo_ln:mcneil-6,1,John McNeil,fl:ja_ln:hickman-4,1,James B. Hickman,d4qaql8cbb3ukjxg7sba2kwtv,1,Michael W. Isheim,,,,,,,,,,,,,,,,,,,
6502257,2003,10/086612,2002,1,0,0,1,1,,0,,,,,A,1,1,1,0,fl:ro_ln:glenn-17,1,Rosemary Glenn,,,,,,,,,,,,,,,,,,,,,,,,,
6502258,2003,09/887243,2001,1,0,0,1,1,,0,,,,,A,1,0,0,0,fl:ma_ln:mitchell-3,,Mary J. Mitchell,,,,,,,,,,,,,,,,,,,,,,,,,
6502259,2003,09/987285,2001,1,0,0,1,1,,0,,,,,A,1,1,1,0,fl:ch_ln:chang-1058,1,Chi-An Chang,,,,,,,,,,,,,,,,,,,,,,,,,
6502260,2003,09/728216,2000,1,0,0,1,1,,0,,,,,A,2,2,2,0,fl:an_ln:viljoen-1,1,Andre F. Viljoen,fl:pi_ln:viljoen-1,1,Pierre Viljoen,,,,,,,,,,,,,,,,,,,,,,
6502261,2003,08/983421,1998,1,1,1,1,1,ELEKTA AB (PUBL),0,SE,Stockholm,,,A,1,1,1,0,fl:wi_ln:harwood-3,1,William R. Harwood,,,,,,,,,,,,,,,,,,,,,,,,,0
6502262,2003,09/624676,2000,1,0,0,1,1,,0,,,,,A,1,1,0,1,fl:do_ln:piscopo-2,0,Donna Piscopo,,,,,,,,,,,,,,,,,,,,,,,,,
6502263,2003,09/915637,2001,1,1,1,1,1,INVACARE CORPORATION,0,US,Elyria,OH,Lorain,A,2,2,1,1,fl:ju_ln:rowley-2,0,Judy Rowley,fl:ja_ln:float-2,1,Jamison Joseph Float,,,,,,,,,,,,,,,,,,,,,,0
6502264,2003,09/657006,2000,1,1,1,1,1,STEVEN J. ANTINORI,1,US,Tampa,FL,Hillsborough County,A,2,2,2,0,fl:do_ln:clothier-1,1,Donald Ralph Clothier,fl:ad_ln:weinman-1,1,Adam Michael Weinman,,,,,,,,,,,,,,,,,,,,,,0
6502265,2003,09/741067,2000,1,1,1,1,1,MAYTAG CORPORATION,0,US,Newton,IA,Jasper,D,8,7,7,0,fl:je_ln:blair-14,1,Jeffrey L. Blair,fl:jo_ln:broker-1,1,John F. Broker,fl:mi_ln:corbett-1,1,Mitchell N. Corbett,fl:do_ln:gardner-21,1,Douglas W. Gardner,fl:br_ln:ness-2,1,Brian L. Ness,fl:do_ln:ocshner-1,,Douglas A. Ocshner,fl:jo_ln:rozendaal-1,1,Joel D. Rozendaal,fl:ki_ln:wright-4,1,Kim L. Wright,,,,0
6502266,2003,09/582467,2000,1,0,0,1,1,,0,,,,,A,1,1,1,0,fl:ma_ln:furuhashi-10,1,Masanobu Furuhashi,,,,,,,,,,,,,,,,,,,,,,,,,
6502267,2003,09/858966,2001,1,1,1,1,1,ALUMINUM LADDER COMPANY,0,US,Florence,SC,Florence,E,2,1,1,0,fl:el_ln:macdonald-5,,Ellie H. MacDonald,fl:da_ln:perry-29,1,David A. Perry,,,,,,,,,,,,,,,,,,,,,,0
6502268,2003,09/837092,2001,1,1,1,1,1,RITE-HITE HOLDING CORPORATION,0,US,Milwaukee,WI,Milwaukee County,E,3,3,3,0,fl:ch_ln:ashelin-2,1,Charles J. Ashelin,fl:ch_ln:digmann-1,1,Charles Digmann,fl:gr_ln:thill-2,1,Gregory J. Thill,,,,,,,,,,,,,,,,,,,0
6502269,2003,09/685386,2000,1,0,0,1,1,,0,,,,,E,2,2,2,0,374zb3qnu4tr9e1d53pd9liwt,1,John A. Balchan,fc8e8pirqgkji6qv4fatscvsy,1,Jerzy W. Scibiorski,,,,,,,,,,,,,,,,,,,,,,
6502270,2003,09/858670,2001,1,1,1,1,1,TAIFUN ENGINEERING OY LTD.,0,FI,Helsinki,,,B,1,1,1,0,fl:ka_ln:rinne-2,1,Kari Rinne,,,,,,,,,,,,,,,,,,,,,,,,,0
6502271,2003,09/492020,2000,1,1,1,1,1,SPEEDFAM-IPEC CORPORATION,0,US,Chandler,AZ,Maricopa,A,1,1,1,0,fl:ya_ln:epshteyn-1,1,Yakov Epshteyn,,,,,,,,,,,,,,,,,,,,,,,,,0
6502272,2003,09/577437,2000,1,1,1,1,1,COLGATE-PALMOLIVE COMPANY,0,US,New York,NY,New York County,A,6,6,6,0,fl:ri_ln:fox-23,1,Rich Fox,fl:ja_ln:hippen-1,1,Jan Hippen,fl:da_ln:knaub-4,1,Dave Knaub,fl:il_ln:resuello-4,1,Ildefonso Resuello,fl:ph_ln:frank-6,1,Phil Frank,fl:ro_ln:moskovich-2,1,Robert Moskovich,,,,,,,,,,0
6502273,2003,09/503626,2000,1,1,1,1,1,"KANEBO, LTD.",0,JP,Tokyo,,,B,6,4,4,0,fl:ko_ln:mihara-1,1,Koji Mihara,fl:sh_ln:gohda-1,1,Shuki Gohda,fl:ma_ln:ide-14,1,Masao Ide,fl:ko_ln:igarashi-5,,Koei Igarashi,fl:ko_ln:tokunaga-1,,Konomu Tokunaga,fl:hi_ln:miyaji-10,1,Hiroshi Miyaji,,,,,,,,,,0
6502274,2003,09/773827,2001,1,1,1,1,1,"VACS AMERICA, INC.",0,US,Burgaw,NC,Pender,A,1,1,1,0,fl:cl_ln:harrelson-1,1,"Clyde W. Harrelson, II",,,,,,,,,,,,,,,,,,,,,,,,,0
6502275,2003,09/721928,2000,1,1,1,1,1,"YE JEN CO., LTD",0,TW,Yuanli,,,A,1,1,1,0,fl:yu_ln:hsieh-21,1,Yung-Lung Hsieh,,,,,,,,,,,,,,,,,,,,,,,,,0
6502276,2003,09/864796,2001,1,0,0,1,1,,0,,,,,A,1,1,1,0,fl:ed_ln:iversen-1,1,Edward P. Iversen,,,,,,,,,,,,,,,,,,,,,,,,,
6502277,2003,09/545356,2000,1,1,1,1,1,AKTIEBOLAGET ELECTROLUX,0,SE,Stockholm,,,A,2,2,2,0,fl:st_ln:petersson-3,1,Stefan Petersson,fl:pa_ln:pastuhoff-1,1,Patrik Pastuhoff,,,,,,,,,,,,,,,,,,,,,,0
6502278,2003,09/813603,2001,1,0,0,1,1,,0,,,,,A,2,2,2,0,fl:ja_ln:oh-7,1,Jang-keun Oh,fl:ky_ln:park-43,1,Kyu-Chang Park,,,,,,,,,,,,,,,,,,,,,,
6502279,2003,09/769725,2001,1,1,1,1,1,NEW ERMES EUROPE S.P.A.,0,IT,Cassano Magnago,,,A,2,1,1,0,fl:ra_ln:marazzi-1,,Raffaele Marazzi,fl:er_ln:roschi-1,1,Ermes Roschi,,,,,,,,,,,,,,,,,,,,,,0
6502280,2003,09/738262,2000,1,1,1,1,1,"SATCO, INC.",0,US,El Segundo,CA,Los Angeles,A,1,1,1,0,fl:ro_ln:looker-1,1,Robert Looker,,,,,,,,,,,,,,,,,,,,,,,,,0
6502281,2003,09/904581,2001,1,1,1,1,1,CANIMEX INC.,0,CA,Drummondville,QC,,E,4,3,3,0,fl:pi_ln:foucault-1,1,Pierre-Louis Foucault,fl:no_ln:savard-1,1,Normand Savard,fl:ra_ln:guay-2,1,Rafael Guay,fl:sa_ln:tousignant-1,,Samuel Tousignant,,,,,,,,,,,,,,,,0
6502282,2003,09/689328,2000,1,0,0,1,1,,0,,,,,E,1,0,0,0,fl:ro_ln:king-70,,Ron E. King,,,,,,,,,,,,,,,,,,,,,,,,,
6502283,2003,09/948740,2001,1,0,0,1,1,,0,,,,,A,1,1,1,0,d8mff8w3lil6gash0oppsvtzn,1,Chuck J. Aguirre,,,,,,,,,,,,,,,,,,,,,,,,,
6502284,2003,09/730638,2000,1,1,1,1,1,"IDAC HOLDINGS, INC.",0,US,New York,NY,New York County,A,2,2,2,0,fl:da_ln:juda-1,1,Daniel P. Juda,fl:ed_ln:sullivan-9,1,Edward Sullivan,,,,,,,,,,,,,,,,,,,,,,0
6502285,2003,09/811282,2001,1,0,0,1,1,,0,,,,,A,1,1,0,1,fl:al_ln:kiely-1,0,Alice Mary Kiely,,,,,,,,,,,,,,,,,,,,,,,,,
6502286,2003,09/647542,2001,1,0,0,1,1,,0,,,,,A,1,1,1,0,fl:ma_ln:dubberke-1,1,Markus Dubberke,,,,,,,,,,,,,,,,,,,,,,,,,
6502287,2003,09/953212,2001,1,1,1,1,1,CERCUEILS ALLIANCE CASKETS INC.,0,CA,Edmundston,NB,,A,3,3,2,1,ztvjjoj6yw3sb67028tp24d71,1,Guillaume Mlchaud,fl:be_ln:beaulieu-2,1,Benoît M. Beaulieu,fl:jo_ln:ouellet-2,0,Jocelyn Ouellet,,,,,,,,,,,,,,,,,,,0
6502288,2003,09/780251,2001,1,1,1,1,1,"POLYMER GROUP, INC.",0,US,North Charleston,SC,Charleston County,D,3,3,3,0,fl:sa_ln:black-1,1,Samuel Keith Black,fl:ch_ln:curtis-13,1,Charles Curtis,fl:ch_ln:carlson-14,1,Cheryl Carlson,,,,,,,,,,,,,,,,,,,0
6502289,2003,09/366895,1999,1,1,1,1,1,"GLOBAL MATERIAL TECHNOLOGIES, INC.",0,US,Palatine,IL,Cook,D,2,2,2,0,fl:te_ln:kane-3,1,Terrence P. Kane,fl:ku_ln:schild-1,1,"Kurt H. Schild, III",,,,,,,,,,,,,,,,,,,,,,0
6502290,2003,09/909719,2001,1,1,1,1,1,TAIWAN PAIHO LIMITED,0,TW,Wang'an Town,,,A,1,1,1,0,fl:to_ln:tseng-3,1,Tony Tseng,,,,,,,,,,,,,,,,,,,,,,,,,0
6502291,2003,09/774663,2001,1,1,1,1,1,HANS STAHLECKER,1,DE,Lützen,,,B,1,1,1,0,fl:fr_ln:stahlecker-1,1,Fritz Stahlecker,,,,,,,,,,,,,,,,,,,,,,,,,1
6502292,2003,09/650320,2000,1,0,0,1,1,,0,,,,,B,1,1,1,0,fl:wi_ln:hartley-4,1,William Hartley,,,,,,,,,,,,,,,,,,,,,,,,,
6502293,2003,09/710350,2000,1,1,1,1,1,"CUMMINS ENGINE COMPANY, INC.",0,US,Columbus,IN,Bartholomew,B,1,1,1,0,fl:ra_ln:khurana-7,1,Ram B. Khurana,,,,,,,,,,,,,,,,,,,,,,,,,0
6502294,2003,09/877766,2001,1,1,1,1,1,UNOVA IP CORP.,0,US,Calabasas,CA,Los Angeles,B,2,1,1,0,fl:ri_ln:kusmierczyk-1,1,Richard A. Kusmierczyk,fl:da_ln:ritthaler-1,,Dale A. Ritthaler,,,,,,,,,,,,,,,,,,,,,,0
6502295,2003,09/723850,2000,1,1,1,1,1,COPARL,0,FR,Amiens,,,B,1,1,1,0,fl:je_ln:morgand-1,1,Jean-Pierre Morgand,,,,,,,,,,,,,,,,,,,,,,,,,0
6502296,2003,09/756172,2001,1,1,1,1,1,NIDEC COPAL CORPORATION,0,JP,Tokyo,,,B,4,3,2,1,fl:no_ln:tachihara-1,,Noribumi Tachihara,fl:no_ln:inoue-23,0,Nobuyoshi Inoue,fl:sh_ln:takahashi-85,1,Shigemi Takahashi,fl:ta_ln:ogawa-65,1,Takao Ogawa,,,,,,,,,,,,,,,,0
6502297,2003,09/927120,2001,1,1,1,1,1,"WI-LAN LABS, INC.",0,US,San Diego,CA,San Diego,B,2,2,2,0,fl:do_ln:giese-2,1,Douglas A. Giese,fl:mi_ln:pagan-1,1,Michael Pagan,,,,,,,,,,,,,,,,,,,,,,0
6502298,2003,09/484417,2000,1,1,1,1,1,"LITTON SYSTEMS, INC.",0,US,Los Angeles,CA,Los Angeles,H,2,2,2,0,fl:ba_ln:witherspoon-1,1,Barry K. Witherspoon,fl:la_ln:vaught-1,1,Larry D. Vaught,,,,,,,,,,,,,,,,,,,,,,0
6502299,2003,09/423735,1999,1,1,1,1,1,"MATSUSHITA ELECTRIC INDUSTRIAL CO., LTD.",0,JP,,,,H,3,3,3,0,fl:ak_ln:yamazaki-5,1,Akihiko Yamazaki,fl:ma_ln:okamoto-44,1,Manabu Okamoto,fl:ka_ln:kimura-31,1,Kazuo Kimura,,,,,,,,,,,,,,,,,,,0
6502300,2003,09/630070,2000,1,1,1,1,1,"WESTERN DIGITAL TECHNOLOGIES, INC.",0,US,Lake Forest,CA,Orange,G,4,4,4,0,fl:sh_ln:casey-4,1,Shawn E. Casey,fl:ra_ln:codilian-1,1,Raffi Codilian,fl:ro_ln:davis-68,1,Roger Davis,fl:jo_ln:haro-3,1,Jorge Haro,,,,,,,,,,,,,,,,0
6502301,2003,09/571345,2000,1,1,1,1,1,"GESTALT TECHNOLOGIES, INC.",0,US,Santa Clara,CA,Santa Clara,B,2,2,2,0,fl:ma_ln:guner-1,1,Mahmut Guner,fl:da_ln:rosenblitt-1,1,David Rosenblitt,,,,,,,,,,,,,,,,,,,,,,0
6502302,2003,09/771223,2001,1,1,1,1,1,"NGK INSULATORS, LTD.",0,JP,Nagoya,,,H,4,3,2,1,fl:yu_ln:takeuchi-20,0,Yukihisa Takeuchi,fl:hi_ln:tsuji-32,1,Hiroyuki Tsuji,fl:ka_ln:kitamura-14,1,Kazumasa Kitamura,fl:yo_ln:yamaguchi-51,,Yoshinori Yamaguchi,,,,,,,,,,,,,,,,0
6502303,2003,09/850362,2001,1,1,1,1,1,CHROMALLOY GAS TURBINE CORPORATION,0,US,San Antonio,TX,Bexar County,B,3,3,3,0,fl:ke_ln:updegrove-1,1,Kevin Updegrove,fl:pe_ln:bader-2,1,Peter Bader,fl:mi_ln:foster-16,1,Michael Foster,,,,,,,,,,,,,,,,,,,0
6502304,2003,09/855444,2001,1,1,1,1,1,GENERAL ELECTRIC COMPANY,0,US,Schenectady,NY,Schenectady County,B,3,3,3,0,fl:jo_ln:rigney-1,1,Joseph David Rigney,fl:wi_ln:walston-1,1,William Walston,fl:ri_ln:grylls-1,1,Richard John Grylls,,,,,,,,,,,,,,,,,,,0
6502305,2003,09/911875,2001,1,1,1,1,1,VALEO THERMIQUE MOTEUR,0,FR,Schœlcher,,,B,2,1,1,0,fl:ca_ln:martins-5,1,Carlos Martins,fl:je_ln:malgouries-1,,Jean-Claude Malgouries,,,,,,,,,,,,,,,,,,,,,,0
6502306,2003,10/183711,2002,1,1,1,1,1,SILVERBROOK RESEARCH PTY LTD,0,AU,Sydney,,,H,1,1,0,1,fl:ki_ln:silverbrook-1,0,Kia Silverbrook,,,,,,,,,,,,,,,,,,,,,,,,,0
6502307,2003,09/843953,2001,1,1,1,1,1,NSK LTD.,0,JP,Tokyo,,,B,3,2,1,1,fl:mi_ln:komaba-1,1,Michio Komaba,fl:ka_ln:kobayashi-25,0,Katsumi Kobayashi,fl:ei_ln:shibuya-2,,Eishi Shibuya,,,,,,,,,,,,,,,,,,,0
6502308,2003,09/831699,2001,1,1,1,1,1,"HAYES LEMMERZ INTERNATIONAL, INC.",0,US,Northville,MI,Wayne County,B,2,2,1,1,77vrz4mbwq7wza9e9ghwaxkns,0,Radmila Carfora,fl:zv_ln:dimovski-1,1,Zvonko Dimovski,,,,,,,,,,,,,,,,,,,,,,0
6502309,2003,09/862279,2001,1,1,1,1,1,KONINKLIJKE PHILIPS ELECTRONICS N.V.,0,NL,Eindhoven,,,B,5,3,3,0,fl:tj_ln:devries-1,,Tjamme De Vries,fl:al_ln:aitink-1,1,Albert Jan Aitink,fl:ma_ln:adriaansen-1,,Marcel Adriaansen,fl:fo_ln:voorhorst-1,1,Fokke Roelof Voorhorst,fl:si_ln:kadijk-1,1,Simon Eme Kadijk,,,,,,,,,,,,,0
6502310,2003,09/591478,2000,1,0,0,1,1,,0,,,,,H,1,1,1,0,fl:ch_ln:shaw-22,1,Christopher Shaw,,,,,,,,,,,,,,,,,,,,,,,,,
6502311,2003,09/374522,1999,1,1,1,1,1,OLYMPIA WERKE AG,0,US,Walnut,CA,Orange,B,2,2,2,0,fl:za_ln:khachatoorian-1,1,Zareh Khachatoorian,fl:ji_ln:qiu-90,1,Jian Ping Qiu,,,,,,,,,,,,,,,,,,,,,,0
6502312,2003,09/884666,2001,1,1,1,1,1,BRAUN GMBH,0,DE,Kronberg,,,B,4,3,2,1,fl:ku_ln:beutel-1,1,Kurt Beutel,fl:wo_ln:franke-1,1,Wolfgang Franke,fl:lu_ln:hess-3,0,Ludwig Hess,fl:ka_ln:schadt-1,,Karl-Heinz Schadt,,,,,,,,,,,,,,,,0
6502313,2003,09/589162,2000,1,0,0,1,1,,0,,,,,B,1,1,1,0,fl:je_ln:bilodeau-5,1,Jérôme Bilodeau,,,,,,,,,,,,,,,,,,,,,,,,,
6502314,2003,09/317279,1999,1,0,0,1,1,,0,,,,,B,1,1,1,0,fl:mi_ln:mccatty-1,1,Michael S. McCatty,,,,,,,,,,,,,,,,,,,,,,,,,
6502315,2003,09/759457,2001,1,1,1,1,1,ANDREAS STIHL AG & CO. KG,0,DE,Waiblingen,,,B,2,2,2,0,fl:jo_ln:menzel-3,1,Johannes Menzel,fl:he_ln:amend-1,1,Helmar Amend,,,,,,,,,,,,,,,,,,,,,,0
6502316,2003,09/864500,2001,1,1,1,1,1,BLACK & DECKER INC.,0,US,Newark,DE,New Castle County,B,4,4,2,2,fl:da_ln:campbell-37,1,David C. Campbell,fl:ga_ln:heslop-3,0,Gale A. Heslop,fl:ly_ln:lentino-1,0,Lynn E. Lentino,fl:mi_ln:sell-1,1,Michael R. Sell,,,,,,,,,,,,,,,,0
6502317,2003,09/955374,2001,1,1,1,1,1,BLACK & DECKER INC.,0,US,Newark,DE,New Castle County,B,5,5,5,0,fl:st_ln:dassoulas-1,1,Stephen C. Dassoulas,fl:ja_ln:melvin-6,1,Jason R. Melvin,fl:ro_ln:moores-1,1,"Robert G. Moores, Jr.",fl:je_ln:grant-5,1,Jeffrey P. Grant,fl:ja_ln:derreth-1,1,James J. Derreth,,,,,,,,,,,,,0
6502318,2003,09/065853,1998,1,1,1,1,1,THE GILLETTE COMPANY,0,US,Boston,MA,Suffolk,B,1,1,1,0,fl:be_ln:gilder-1,1,Bernard Gilder,,,,,,,,,,,,,,,,,,,,,,,,,0
6502319,2003,09/684696,2000,1,1,1,1,1,"LEVELITE TECHNOLOGY, INC.",0,US,Mountain View,CA,Santa Clara,G,2,2,2,0,fl:ga_ln:goodrich-2,1,Gary Goodrich,xo9j6rjmqrfz654g552ygltuy,1,Larry Lemer,,,,,,,,,,,,,,,,,,,,,,0
6502320,2003,10/136093,2002,1,1,1,1,1,SMITHKLINE BEECHAM CORPORATION,0,US,Philadelphia,PA,Philadelphia,G,2,1,1,0,fl:ch_ln:buckner-1,,"Charles A. Buckner, III",fl:jo_ln:mascho-1,1,"John Anderson Mascho, Jr.",,,,,,,,,,,,,,,,,,,,,,0
6502321,2003,09/648945,2000,1,1,1,1,1,"CRAIN ENTERPRISES, INC.",0,US,Rockford,IL,Winnebago County,G,5,5,5,0,fl:st_ln:crain-5,1,Stephen B. Crain,fl:ro_ln:everly-1,1,Ronnie D. Everly,fl:la_ln:essex-1,1,Larry W. Essex,fl:ra_ln:mize-2,1,Ralph C. Mize,fl:je_ln:williamson-5,1,Jerry L. Williamson,,,,,,,,,,,,,0
6502322,2003,09/798910,2001,1,0,0,1,1,,0,,,,,G,1,0,0,0,fl:st_ln:smochek-1,,Stanley J. Smochek,,,,,,,,,,,,,,,,,,,,,,,,,
6502323,2003,09/924030,2001,1,1,1,1,1,SWAGELOK COMPANY,0,US,Solon,OH,Cuyahoga,G,2,2,2,0,fl:pe_ln:williams-7,1,Peter C. Williams,fl:lo_ln:johnston-2,1,Lonnie E. Johnston,,,,,,,,,,,,,,,,,,,,,,0
6502324,2003,09/735038,2000,1,1,1,1,1,INTERNATIONAL BUSINESS MACHINES CORPORATION,0,US,Armonk,NY,Westchester,G,4,3,3,0,fl:mi_ln:noguchi-25,,Michikazu Noguchi,fl:ts_ln:heitoh-1,1,Tsuneo Heitoh,fl:ev_ln:colgan-2,1,Evan G. Colgan,fl:ma_ln:suzuki-71,1,Masaru Suzuki,,,,,,,,,,,,,,,,0
6502325,2003,09/634211,2000,1,1,1,1,1,COLGATE-PALMOLIVE COMPANY,0,US,New York,NY,New York County,F,4,4,0,4,fl:ma_ln:zappone-1,0,Marianne Zappone,fl:di_ln:umstead-1,0,Dixie June Umstead,fl:ma_ln:heibel-1,0,Marija Heibel,fl:sa_ln:ibrahim-10,0,Sayed Ibrahim,,,,,,,,,,,,,,,,0
6502326,2003,09/645575,2000,1,1,1,1,1,MASCHINENFABRIK J. DIEFFENBACHER GMBH & CO.,0,DE,Eppingen,,,F,1,1,1,0,fl:fr_ln:bielfeldt-1,1,Friedrich B. Bielfeldt,,,,,,,,,,,,,,,,,,,,,,,,,0
6502327,2003,09/919869,2001,1,1,1,1,1,"SHIKOKU KAKOKI CO., LTD.",0,JP,Tokushima,,,F,4,3,3,0,fl:sa_ln:kume-2,1,Satoshi Kume,fl:hi_ln:katayama-11,,Hiroshi Katayama,fl:sh_ln:tawa-1,1,Shigenori Tawa,fl:mi_ln:ueda-16,1,Michio Ueda,,,,,,,,,,,,,,,,0
6502328,2003,09/573108,2000,1,1,1,1,1,"ARROW PNEUMATICS, INC.",0,US,Broadview,IL,Cook,F,3,3,3,0,fl:wa_ln:love-2,1,Wayne G. Love,10wn2207ef8egvbnqvzk1jl9l,1,Clyde R. Kerns,qy0ef3lsak6qpmgcstlillly3,1,Stephen B. Ciotti,,,,,,,,,,,,,,,,,,,0
6502329,2003,09/433752,1999,1,0,0,1,1,,0,,,,,A,1,1,1,0,fl:ho_ln:silagy-1,1,Howard Silagy,,,,,,,,,,,,,,,,,,,,,,,,,
6502330,2003,09/720485,2001,1,0,0,1,1,,0,,,,,A,3,3,3,0,fl:lo_ln:david-2,1,Loic David,fl:je_ln:rivet-3,1,Jean-Jaques Rivet,fl:mi_ln:maestro-2,1,Michel Maestro,,,,,,,,,,,,,,,,,,,
6502331,2003,09/731162,2000,1,0,0,1,1,,0,,,,,A,1,1,1,0,fl:wi_ln:hines-7,1,William J. Hines,,,,,,,,,,,,,,,,,,,,,,,,,
6502332,2003,09/705693,2000,1,1,1,1,1,YUGENKAISHA SHINJO SEISAKUSHO,0,JP,Osaka,,,A,1,1,1,0,fl:hi_ln:nakayama-22,1,Hiroshi Nakayama,,,,,,,,,,,,,,,,,,,,,,,,,0
6502333,2003,09/362990,1999,1,0,0,1,1,,0,,,,,E,1,1,1,0,1evxydicicjb1tbugl5b1y4rp,1,Randall R. Striegel,,,,,,,,,,,,,,,,,,,,,,,,,
6502334,2003,09/431262,1999,1,0,0,1,1,,0,,,,,E,1,1,1,0,fl:st_ln:davies-9,1,Stephen Davies,,,,,,,,,,,,,,,,,,,,,,,,,
6502335,2003,09/811294,2001,1,1,1,1,1,ARIENS COMPANY,0,US,Brillion,WI,Calumet,E,3,3,3,0,fl:pe_ln:prochnow-1,1,Perry Prochnow,fl:jo_ln:adrian-6,1,John Adrian,fl:sc_ln:deschler-1,1,Scott Deschler,,,,,,,,,,,,,,,,,,,0
6502336,2003,09/921972,2001,1,1,1,1,1,TRN BUSINESS TRUST,0,US,Dallas,TX,Dallas County,E,1,1,1,0,fl:sh_ln:pippins-1,1,Sherlock Pippins,,,,,,,,,,,,,,,,,,,,,,,,,0
6502337,2003,09/624229,2000,1,1,1,1,1,"ORIENTAL SANGYO, LTD.",0,JP,Osaka,,,G,1,1,1,0,fl:ya_ln:ochi-4,1,Yasushi Ochi,,,,,,,,,,,,,,,,,,,,,,,,,0
6502338,2003,09/366515,1999,1,0,0,1,1,,0,,,,,G,1,1,1,0,fl:ro_ln:marshall-28,1,Roger S. Marshall,,,,,,,,,,,,,,,,,,,,,,,,,
6502339,2003,09/596337,2000,1,0,0,1,1,,0,,,,,G,1,1,1,0,fl:pa_ln:shapiro-3,1,Paul W. Shapiro,,,,,,,,,,,,,,,,,,,,,,,,,
6502340,2003,09/838746,2001,1,0,0,1,1,,0,,,,,G,2,2,2,0,fl:m._ln:stone-2,1,M. Steve Stone,fl:to_ln:stone-2,1,Tony R. Stone,,,,,,,,,,,,,,,,,,,,,,
6502341,2003,09/504488,2000,1,1,1,1,1,EASTMAN KODAK COMPANY,0,US,Rochester,NY,Monroe,A,1,1,1,0,fl:ja_ln:truc-1,1,James A. Truc,,,,,,,,,,,,,,,,,,,,,,,,,0
6502342,2003,09/458628,1999,1,1,1,1,1,EASTMAN KODAK COMPANY,0,US,Rochester,NY,Monroe,A,1,1,1,0,fl:sc_ln:riley-5,1,Scott Riley,,,,,,,,,,,,,,,,,,,,,,,,,0
6502343,2003,09/820720,2001,1,1,1,1,1,NATIONAL TAIWAN UNIVERSITY OF SCIENCE AND TECHNOLOGY,0,TW,Taipei,,,F,1,1,1,0,fl:jo_ln:cheng-21,1,Joung Young Cheng,,,,,,,,,,,,,,,,,,,,,,,,,1
6502344,2003,09/717933,2000,1,1,1,1,1,HORST BLASER JAGDWAFFENFABRIK,0,DE,Isny im Allgäu,,,F,2,2,2,0,fl:me_ln:zeh-1,1,Meinrad Zeh,fl:ge_ln:blenk-1,1,Gerhard Blenk,,,,,,,,,,,,,,,,,,,,,,0
6502345,2003,09/838851,2001,1,0,0,1,1,,0,,,,,A,1,1,1,0,fl:ra_ln:doyle-5,1,Randell Doyle,,,,,,,,,,,,,,,,,,,,,,,,,
6502346,2003,09/576593,2000,1,0,0,1,1,,0,,,,,A,1,1,1,0,fl:ma_ln:jokinen-4,1,Maynard Arne Jokinen,,,,,,,,,,,,,,,,,,,,,,,,,
6502347,2003,10/066696,2002,1,1,1,1,1,JAMES E. SMITH,1,US,Midlothian,VA,Chesterfield,A,1,1,1,0,fl:ro_ln:carver-9,1,Robert W. Carver,,,,,,,,,,,,,,,,,,,,,,,,,0
6502348,2003,09/740503,2000,1,0,0,1,1,,0,,,,,A,1,1,1,0,fl:al_ln:bernard-7,1,Alan Bernard,,,,,,,,,,,,,,,,,,,,,,,,,
6502349,2003,09/867686,2001,1,0,0,1,1,,0,,,,,A,2,0,0,0,fl:cl_ln:richet-1,,Clarke Richet,fl:ca_ln:richet-1,,Catharine Richet,,,,,,,,,,,,,,,,,,,,,,
6502350,2003,09/720155,2001,1,1,1,1,1,JAMES QUINTON CAMERON DICK,1,ZA,East London,,,A,1,1,1,0,fl:ja_ln:dick-9,1,James Quinton Cameron Dick,,,,,,,,,,,,,,,,,,,,,,,,,0
6502351,2003,10/150806,2002,1,1,1,1,1,"SOUTHPAC TRUST INTERNATIONAL, INC.",0,US,,KS,Decatur County,A,1,1,1,0,fl:do_ln:weder-1,1,Donald E. Weder,,,,,,,,,,,,,,,,,,,,,,,,,0
6502352,2003,09/254159,1999,1,1,1,1,1,MERITOR LIGHT VEHICLE SYSTEMS-FRANCE,0,FR,Courbevoie,,,F,1,1,1,0,fl:pa_ln:bonduel-1,1,Pascal Bonduel,,,,,,,,,,,,,,,,,,,,,,,,,0
6502353,2003,09/789399,2001,1,1,1,1,1,LAFARGE ROOFING COMPONENTS GMBH & CO. KG,0,DE,Oberursel,,,E,1,1,1,0,fl:ka_ln:hofmann-15,1,Karl Hofmann,,,,,,,,,,,,,,,,,,,,,,,,,0
6502354,2003,09/760255,2001,1,1,1,1,1,PAUL R. EMERSON,1,US,Lodi,CA,San Joaquin,E,2,2,2,0,fl:ra_ln:mcclure-6,1,Ralph E. McClure,fl:eu_ln:jenkins-1,1,Eugene Jenkins,,,,,,,,,,,,,,,,,,,,,,0
6502355,2003,09/435758,1999,1,0,0,1,1,,0,,,,,E,1,1,1,0,fl:al_ln:bori-1,1,Albert Bori,,,,,,,,,,,,,,,,,,,,,,,,,
6502356,2003,09/796646,2001,1,1,1,1,1,ARPAL ALUMINUM LTD.,0,IL,Lod,,,E,1,1,1,0,fl:mo_ln:emek-1,1,Mordechay Emek,,,,,,,,,,,,,,,,,,,,,,,,,0
6502357,2003,09/512530,2000,1,1,1,1,1,GSI GROUP CORPORATION,0,US,Assumption,IL,Christian,E,4,4,4,0,fl:th_ln:stuthman-1,1,Thomas Stuthman,5rawprvyjpsadik6s4wt6t705,1,Brian Dust,fl:co_ln:knight-2,1,Corey Knight,fl:eu_ln:pollock-3,1,Eugene B. Pollock,,,,,,,,,,,,,,,,0
6502358,2003,09/844300,2001,1,0,0,1,1,,0,,,,,E,1,1,1,0,fl:ti_ln:smythe-1,1,Timothy Smythe,,,,,,,,,,,,,,,,,,,,,,,,,
6502359,2003,09/784788,2001,1,1,1,1,1,"BOMETALS, INC.",0,US,Powder Springs,GA,Cobb,E,1,1,1,0,fl:to_ln:rambo-1,1,Todd Rambo,,,,,,,,,,,,,,,,,,,,,,,,,0
6502360,2003,09/817995,2001,1,1,1,1,1,"THANTEX SPECIALTIES, INC.",0,US,Arden,NC,Buncombe,E,3,3,3,0,fl:ri_ln:carr-9,1,Richard W. Carr,fl:st_ln:clarke-4,1,Steven Clarke,fl:jo_ln:mitchell-23,1,John G. Mitchell,,,,,,,,,,,,,,,,,,,0
6502361,2003,09/918236,2001,1,0,0,1,1,,0,,,,,E,1,1,1,0,fl:ro_ln:hills-7,1,"Robert A. Hills, Sr.",,,,,,,,,,,,,,,,,,,,,,,,,
6502362,2003,09/594818,2000,1,0,0,1,1,,0,,,,,E,2,2,2,0,fl:se_ln:zambelli-1,1,Sergio Zambelli,fl:be_ln:zambelli-1,1,Benito Zambelli,,,,,,,,,,,,,,,,,,,,,,
6502363,2003,09/841647,2001,1,0,0,1,1,,0,,,,,E,1,0,0,0,fl:st_ln:roth-12,,Steven A. Roth,,,,,,,,,,,,,,,,,,,,,,,,,
6502364,2003,09/896168,2001,1,0,0,1,1,,0,,,,,E,1,1,1,0,fl:dw_ln:richardson-2,1,Dwayne Richardson,,,,,,,,,,,,,,,,,,,,,,,,,
6502365,2003,09/536493,2000,1,1,1,1,1,PPG INDUSTRIES GLASS S.A.,0,FR,Puteaux,,,E,3,3,2,1,fl:de_ln:legrand-1,0,Denis Legrand,fl:be_ln:savaete-1,1,Bernard Savaëte,fl:an_ln:singer-11,1,Andre Singer,,,,,,,,,,,,,,,,,,,0
6502366,2003,09/593520,2000,1,1,1,1,1,"TOKYO AUTOMATIC MACHINERY WORKS, LTD.",0,JP,Tokyo,,,B,2,2,2,0,fl:ta_ln:inoue-80,1,Tatsuo Inoue,fl:na_ln:kakutani-1,1,Naohiko Kakutani,,,,,,,,,,,,,,,,,,,,,,0
6502367,2003,09/558706,2000,1,1,1,1,1,FLEXICON CORPORATION,0,US,Jackson,NJ,Ocean,B,4,3,3,0,fl:ke_ln:sterner-2,1,Keith Sterner,fl:de_ln:graham-9,1,Dennis E. Graham,fl:jo_ln:simonof-1,1,"John F. Simonof, Jr.",fl:da_ln:gill-19,,David R. Gill,,,,,,,,,,,,,,,,0
6502368,2003,09/574654,2000,1,1,1,1,1,"SOUTHPAC TRUST INTERNATIONAL, INC.",0,US,,KS,Decatur County,B,1,1,1,0,fl:st_ln:grether-1,1,Stephan Grether,,,,,,,,,,,,,,,,,,,,,,,,,0
6502369,2003,09/696314,2000,1,1,1,1,1,AMCOR TWINPAK-NORTH AMERICA INC.,0,CA,,,,B,2,2,2,0,fl:da_ln:andison-1,1,David Andison,fl:st_ln:scheffer-2,1,Steven Scheffer,,,,,,,,,,,,,,,,,,,,,,0
6502370,2003,09/919884,2001,1,0,0,1,1,,0,,,,,B,1,1,1,0,fl:gu_ln:martelli-1,1,Guglielmo Martelli,,,,,,,,,,,,,,,,,,,,,,,,,
6502371,2003,09/796120,2001,1,1,1,1,1,BOB DEMATTEIS CO.,0,US,Grass Valley,CA,Nevada,B,1,1,1,0,fl:ro_ln:dematteis-1,1,Robert B. DeMatteis,,,,,,,,,,,,,,,,,,,,,,,,,0
6502372,2003,09/623096,2000,1,1,1,1,1,TETRA LAVAL HOLDINGS & FINANCE S.A.,0,CH,Pully,,,B,2,1,1,0,fl:ma_ln:kaneko-46,1,Masamichi Kaneko,fl:ma_ln:rabe-2,,Magnus Råbe,,,,,,,,,,,,,,,,,,,,,,0