patent_number,grant_year,application_number,application_year,d_inventor,d_assignee,d_location,d_application,d_ipc,assignee,assignee_ind,country,city,state,county,ipc_section,team_size,inventors,men_inventors,women_inventors,inventor_id1,male_flag1,inventor_name1,inventor_id2,male_flag2,inventor_name2,inventor_id3,male_flag3,inventor_name3,inventor_id4,male_flag4,inventor_name4,inventor_id5,male_flag5,inventor_name5,inventor_id6,male_flag6,inventor_name6,inventor_id7,male_flag7,inventor_name7,inventor_id8,male_flag8,inventor_name8,inventor_id9,male_flag9,inventor_name9,assignee_sequence
6671884,2004,10/286378,2002,1,1,1,1,1,"KIMBERLY-CLARK WORLDWIDE, INC.",0,US,Neenah,WI,Winnebago,A,2,2,2,0,fl:he_ln:griesbach-1,1,"Henry L. Griesbach, III",fl:li_ln:harris-1,1,Linda G. Harris,,,,,,,,,,,,,,,,,,,,,,0
6671885,2004,09/922056,2001,1,0,0,1,1,,0,,,,,A,1,1,0,1,fl:da_ln:viggiano-2,0,Darrin Viggiano,,,,,,,,,,,,,,,,,,,,,,,,,
6671886,2004,10/347813,2003,1,0,0,1,1,,0,,,,,A,1,1,1,0,fl:ne_ln:reitz-1,1,Neal M. Reitz,,,,,,,,,,,,,,,,,,,,,,,,,
6671887,2004,10/302695,2002,1,0,0,1,1,,0,,,,,A,2,2,2,0,kn0o53jkgnfdnwqv2xy6z5h2j,1,Raymond Eligan,fl:da_ln:brown-16,1,Darryl Brown,,,,,,,,,,,,,,,,,,,,,,
6671888,2004,10/113166,2002,1,0,0,1,1,,0,,,,,A,1,1,1,0,fl:sc_ln:wallace-1,1,Scot Wallace,,,,,,,,,,,,,,,,,,,,,,,,,
6671889,2004,10/435950,2003,1,0,0,1,1,,0,,,,,A,2,2,2,0,fl:mi_ln:dennis-8,1,Michael Dennis,fl:ru_ln:monk-1,1,Russell A. Monk,,,,,,,,,,,,,,,,,,,,,,
6671890,2004,10/022157,2001,1,1,1,1,1,"SAN-EI FAUCET MFG. CO., LTD.",0,JP,Osaka,,,E,1,1,1,0,fl:ak_ln:nishioka-5,1,Akira Nishioka,,,,,,,,,,,,,,,,,,,,,,,,,0
6671891,2004,09/799888,2001,1,0,0,1,1,,0,,,,,E,2,0,0,0,fl:xi_ln:qi-59,,Xiaoming Qi,fl:ru_ln:qi-9,,Ru-Yi Qi,,,,,,,,,,,,,,,,,,,,,,
6671892,2004,10/160706,2002,1,0,0,1,1,,0,,,,,A,1,1,1,0,yulp8qim2gwv7uf2g38qfhv4r,1,Gary L. Plyant,,,,,,,,,,,,,,,,,,,,,,,,,
6671893,2004,10/321931,2002,1,1,1,1,1,NICCOLE FAMILY TRUST,0,US,Tecate Mission Road,CA,Orange County,E,2,2,2,0,fl:ri_ln:quintana-1,1,Richard Quintana,fl:de_ln:niccole-1,1,Devon Niccole,,,,,,,,,,,,,,,,,,,,,,0
6671894,2004,10/431037,2003,1,0,0,1,1,,0,,,,,E,1,1,1,0,fl:er_ln:sigrist-2,1,Ernest Sigrist,,,,,,,,,,,,,,,,,,,,,,,,,
6671895,2004,10/146746,2002,1,1,1,1,1,"LATHAM POOL PRODUCTS, INC.",0,US,Scotia,NY,Town of Glenville,E,1,1,1,0,fl:cr_ln:lewis-5,1,Craig Lewis,,,,,,,,,,,,,,,,,,,,,,,,,0
6671896,2004,10/159277,2002,1,1,1,1,1,BRAND NEW TECHNOLOGY LTD.,0,CN,Kowloon,,,A,1,1,0,1,fl:hi_ln:tse-3,0,Hing Fai Tse,,,,,,,,,,,,,,,,,,,,,,,,,0
6671897,2004,10/315312,2002,1,0,0,1,1,,0,,,,,A,1,1,1,0,32o3hx9up8rftu4cq4xloy2xy,1,Alfred M. Votypka,,,,,,,,,,,,,,,,,,,,,,,,,
6671898,2004,10/111300,2002,1,1,1,1,1,GEBERIT TECHNIK AG,0,CH,,,,F,3,3,3,0,fl:wa_ln:eggenberger-1,1,Walter Eggenberger,fl:ch_ln:hauser-7,1,Christoph Hauser,fl:jo_ln:marquart-3,1,Jochen Marquart,,,,,,,,,,,,,,,,,,,0
6671899,2004,10/176316,2002,1,0,0,1,1,,0,,,,,A,1,1,1,0,fl:je_ln:oja-3,1,Jeffrey E. Oja,,,,,,,,,,,,,,,,,,,,,,,,,
6671900,2004,09/798065,2001,1,1,1,1,1,WALDON DAVIS,1,US,Chester,AR,Crawford,B,1,1,1,0,fl:wa_ln:davis-30,1,Waldon Davis,,,,,,,,,,,,,,,,,,,,,,,,,0
6671901,2004,10/181026,2002,1,0,0,1,1,,0,,,,,A,1,0,0,0,fl:ut_ln:zenczykowski-1,,Uta Zenczykowski,,,,,,,,,,,,,,,,,,,,,,,,,
6671902,2004,09/997566,2001,1,0,0,1,1,,0,,,,,A,1,1,1,0,fl:ke_ln:cheng-23,1,Kenny Cheng,,,,,,,,,,,,,,,,,,,,,,,,,
6671903,2004,10/124650,2002,1,0,0,1,1,,0,,,,,A,2,2,1,1,fl:do_ln:bowers-6,1,Douglas Bowers,fl:re_ln:bowers-1,0,Rebecca Bowers,,,,,,,,,,,,,,,,,,,,,,
6671904,2004,10/292360,2002,1,1,1,1,1,STERIS INC.,0,US,Temecula,CA,Riverside,A,1,1,1,0,fl:ba_ln:easterling-1,1,Barry A. Easterling,,,,,,,,,,,,,,,,,,,,,,,,,0
6671905,2004,09/821552,2001,1,1,1,1,1,"KCI LICENSING, INC.",0,US,San Antonio,TX,Bexar County,A,3,3,3,0,fl:al_ln:bartlett-8,1,Alan L. Bartlett,fl:wl_ln:krywiczanin-1,1,Wladyslaw H. Krywiczanin,fl:ch_ln:niederkrom-2,1,Christopher T. Niederkrom,,,,,,,,,,,,,,,,,,,0
6671906,2004,10/191165,2002,1,0,0,1,1,,0,,,,,A,1,1,1,0,fl:pa_ln:milligan-4,1,Patrick L. Milligan,,,,,,,,,,,,,,,,,,,,,,,,,
6671907,2004,10/412873,2003,1,0,0,1,1,,0,,,,,A,1,1,1,0,fl:na_ln:zuberi-2,1,Najeeb A. Zuberi,,,,,,,,,,,,,,,,,,,,,,,,,
6671908,2004,10/046377,2001,1,1,1,1,1,THE BOPPY COMPANY,0,US,Golden,CO,Jefferson,A,2,2,0,2,fl:su_ln:brown-11,0,Susan Brown,fl:su_ln:ganter-1,0,Susan Ganter,,,,,,,,,,,,,,,,,,,,,,0
6671910,2004,10/007681,2001,1,1,1,1,1,INTEX RECREATION CORP.,0,US,Long Beach,CA,Los Angeles,A,2,2,1,1,fl:ya_ln:hsu-4,0,Yaw Yuan Hsu,fl:ch_ln:pan-91,1,Chin-Hsiang Pan,,,,,,,,,,,,,,,,,,,,,,0
6671911,2004,09/574939,2000,1,1,1,1,1,"HILL ENGINEERING, INC.",0,US,San Diego,CA,San Diego,A,3,2,1,1,fl:ch_ln:hill-16,1,Charles C. Hill,fl:th_ln:hill-2,,Theodore B. Hill,fl:ca_ln:anderson-17,0,Carly A. Anderson,,,,,,,,,,,,,,,,,,,0
6671912,2004,10/244251,2002,1,0,0,1,1,,0,,,,,A,2,2,1,1,fl:ti_ln:tsai-41,1,Tien-Min Tsai,fl:je_ln:tsai-16,0,Jen-Hsiu Tsai,,,,,,,,,,,,,,,,,,,,,,
6671913,2004,09/798265,2001,1,0,0,1,1,,0,,,,,B,1,1,1,0,fl:ma_ln:wozniak-8,1,Martin Wozniak,,,,,,,,,,,,,,,,,,,,,,,,,
6671914,2004,10/028186,2001,1,1,1,1,1,MAYTAG CORPORATION,0,US,Newton,IA,Jasper,D,2,1,1,0,fl:br_ln:england-3,1,Brent A. England,fl:an_ln:gates-2,,Anthony M. Gates,,,,,,,,,,,,,,,,,,,,,,0
6671915,2004,09/880189,2001,1,1,1,1,1,PHARMAGG SYSTEMTECHNIK GMBH,0,DE,Bad Oeynhausen,,,D,2,2,2,0,fl:wi_ln:bringewatt-1,1,Wilhelm Bringewatt,fl:fa_ln:mehrmann-1,1,Falk F. Mehrmann,,,,,,,,,,,,,,,,,,,,,,0
6671916,2004,09/919793,2001,1,1,1,1,1,MAYTAG CORPORATION,0,US,Newton,IA,Jasper,D,5,5,3,2,fl:ne_ln:herr-1,0,Nedra A. Herr,fl:ki_ln:hood-1,0,Kimberly Hood,fl:mi_ln:lafrenz-1,1,Michael D. Lafrenz,fl:br_ln:ness-2,1,Brian L. Ness,fl:br_ln:oleson-2,1,Brett C. Oleson,,,,,,,,,,,,,0
6671917,2004,09/864871,2001,1,1,1,1,1,"NISHINA INDUSTRIAL CO., LTD.",0,JP,Soma,,,B,1,0,0,0,fl:it_ln:nishina-1,,Itsuo Nishina,,,,,,,,,,,,,,,,,,,,,,,,,0
6671918,2004,09/881399,2001,1,1,1,1,1,SHARP KABUSHIKI KAISHA,0,JP,Osaka,,,B,3,3,3,0,fl:to_ln:matsuno-8,1,Tomofumi Matsuno,fl:mi_ln:uemura-5,1,Mitsuo Uemura,fl:ka_ln:yoshimura-22,1,Kazuya Yoshimura,,,,,,,,,,,,,,,,,,,0
6671919,2004,10/389863,2003,1,0,0,1,1,,0,,,,,A,1,1,0,1,fl:co_ln:davis-7,0,Colin Davis,,,,,,,,,,,,,,,,,,,,,,,,,
6671920,2004,09/769063,2001,1,0,0,1,1,,0,,,,,A,2,2,2,0,fl:ja_ln:pearlman-2,1,Jay C. Pearlman,fl:do_ln:russell-26,1,Douglas R. Russell,,,,,,,,,,,,,,,,,,,,,,
6671921,2004,09/567222,2000,1,0,0,1,1,,0,,,,,A,1,1,1,0,fl:br_ln:hickman-8,1,Bradley L. Hickman,,,,,,,,,,,,,,,,,,,,,,,,,
6671922,2004,09/601851,2000,1,1,1,1,1,ROBERT BOSCH GMBH,0,DE,Stuttgart,,,B,4,4,4,0,fl:ro_ln:geilenkirchen-1,1,Robert Geilenkirchen,fl:hu_ln:verelst-1,1,Hubert Verelst,fl:di_ln:deconinck-1,1,Dirk De Coninck,fl:pa_ln:wynen-1,1,Paul Wynen,,,,,,,,,,,,,,,,0
6671923,2004,10/073603,2002,1,0,0,1,1,,0,,,,,A,1,0,0,0,fl:ma_ln:gromnicki-1,,Martin F Gromnicki,,,,,,,,,,,,,,,,,,,,,,,,,
6671924,2004,10/013376,2001,1,0,0,1,1,,0,,,,,A,1,1,1,0,fl:ri_ln:rood-2,1,Richard K. Rood,,,,,,,,,,,,,,,,,,,,,,,,,
6671925,2004,10/152537,2002,1,1,1,1,1,TENNANT COMPANY,0,US,Minneapolis,MN,Hennepin,A,5,5,5,0,fl:br_ln:field-2,1,Bruce F. Field,fl:jo_ln:krueger-21,1,Joseph K. Krueger,fl:da_ln:joynt-1,1,Daniel L. Joynt,fl:jo_ln:pouliot-1,1,Joseph Pouliot,fl:da_ln:mchugh-3,1,Daniel J. McHugh,,,,,,,,,,,,,0
6671926,2004,10/097381,2002,1,1,1,1,1,LINK TREASURE LIMITED,0,VG,Road Town,,,B,1,1,1,0,fl:pa_ln:huang-30,1,Pao-Shan Huang,,,,,,,,,,,,,,,,,,,,,,,,,0
6671927,2004,10/175321,2002,1,1,1,1,1,LITE-ON TECHNOLOGY CORPORATION,0,TW,Taipei,,,E,1,1,1,0,fl:ch_ln:chen-2076,1,Chi-Mi Chen,,,,,,,,,,,,,,,,,,,,,,,,,0
6671928,2004,09/862300,2001,1,0,0,1,1,,0,,,,,E,1,1,1,0,fl:ku_ln:huang-99,1,Kuo-Cheng Huang,,,,,,,,,,,,,,,,,,,,,,,,,
6671929,2004,10/242940,2002,1,1,1,1,1,"SHIN ZU SHING CO., LTD.",0,TW,,,,E,1,1,1,0,fl:sh_ln:lu-110,1,Sheng-Nan Lu,,,,,,,,,,,,,,,,,,,,,,,,,0
6671930,2004,09/764249,2001,1,0,0,1,1,,0,,,,,A,1,1,1,0,fl:do_ln:lanz-1,1,Donald D. Lanz,,,,,,,,,,,,,,,,,,,,,,,,,
6671931,2004,10/179490,2002,1,0,0,1,1,,0,,,,,A,1,1,1,0,fl:da_ln:duncan-23,1,David Duncan,,,,,,,,,,,,,,,,,,,,,,,,,
6671932,2004,09/959958,2002,1,0,0,1,1,,0,,,,,G,1,1,1,0,u27adf5etrlloi2lzxzsbfetp,1,Maxime Brugniaux,,,,,,,,,,,,,,,,,,,,,,,,,
6671933,2004,10/134217,2002,1,0,0,1,1,,0,,,,,A,2,2,2,0,fl:ro_ln:friend-4,1,Roxane Friend,fl:ja_ln:friend-2,1,James Friend,,,,,,,,,,,,,,,,,,,,,,
6671934,2004,10/170485,2002,1,1,1,1,1,INTIER AUTOMOTIVE INC.,0,CA,Aurora,ON,,A,2,2,2,0,fl:st_ln:wenzlick-1,1,Stanley J. Wenzlick,fl:wa_ln:kornylo-1,1,Walter P. Kornylo,,,,,,,,,,,,,,,,,,,,,,0
6671935,2004,10/277309,2002,1,1,1,1,1,VELCRO INDUSTRIES B.V.,0,NL,Nijkerk,,,A,2,2,2,0,fl:sc_ln:filion-1,1,Scott M. Filion,fl:ri_ln:schmidt-11,1,Richard Schmidt,,,,,,,,,,,,,,,,,,,,,,0
6671936,2004,09/634482,2000,1,1,1,1,1,"POLYMER GROUP, INC.",0,US,North Charleston,SC,Charleston County,D,4,3,3,0,fl:ch_ln:carlson-14,1,Cheryl Carlson,fl:an_ln:chier-1,,Andrew Leonard Chier,fl:ja_ln:lenox-1,1,James Lenox,fl:ni_ln:carter-4,1,Nick Carter,,,,,,,,,,,,,,,,0
6671937,2004,09/688789,2000,1,1,1,1,1,SUZUKI WARPER LTD.,0,JP,Shibukawa,,,B,1,1,1,0,fl:yo_ln:tanaka-34,1,Yoshihiro Tanaka,,,,,,,,,,,,,,,,,,,,,,,,,0
6671938,2004,09/749319,2000,1,1,1,1,1,UNITED TECHNOLOGIES CORPORATION,0,US,Hartford,CT,Hartford,B,1,1,1,0,fl:ch_ln:mcfarland-3,1,Christopher McFarland,,,,,,,,,,,,,,,,,,,,,,,,,0
6671939,2004,10/099671,2002,1,1,1,1,1,"NGK INSULATORS, LTD.",0,JP,Nagoya,,,H,3,3,2,1,fl:yu_ln:takeuchi-20,0,Yukihisa Takeuchi,fl:ts_ln:nanataki-1,1,Tsutomu Nanataki,fl:ko_ln:kimura-24,1,Koji Kimura,,,,,,,,,,,,,,,,,,,0
6671940,2004,09/956147,2001,1,1,1,1,1,ISHII TOOL & ENGINEERING CORPORATION,0,JP,Usuki,,,B,1,1,1,0,fl:mi_ln:ishii-32,1,Mitoshi Ishii,,,,,,,,,,,,,,,,,,,,,,,,,0
6671941,2004,09/723275,2000,1,1,1,1,1,BAE SYSTEMS PLC,0,GB,Farnborough,,,B,4,4,4,0,fl:wi_ln:scott-29,1,William Smith Scott,fl:si_ln:cheetham-1,1,Simon Cheetham,fl:ru_ln:mckeown-1,1,Russell P McKeown,fl:ke_ln:fowler-10,1,Kevin Fowler,,,,,,,,,,,,,,,,0
6671942,2004,10/106241,2002,1,1,1,1,1,DENSO CORPORATION,0,JP,Kariya,,,B,2,2,2,0,fl:yu_ln:ohba-6,1,Yukio Ohba,fl:ak_ln:nishimatsu-1,1,Akira Nishimatsu,,,,,,,,,,,,,,,,,,,,,,0
6671943,2004,08/993316,1997,1,1,1,1,1,TOYOTA JIDOSHA KABUSHIKI KAISHA,0,JP,Toyota,,,B,5,5,5,0,fl:ka_ln:mori-19,1,Kazuhiko Mori,fl:ko_ln:kodama-6,1,Kouta Kodama,fl:ta_ln:miyamoto-9,1,Taisuke Miyamoto,fl:yo_ln:fuwa-1,1,Yoshio Fuwa,fl:ko_ln:saitoh-14,1,Kouji Saitoh,,,,,,,,,,,,,0
6671944,2004,09/848689,2001,1,1,1,1,1,INTERNATIONAL COMMUNICATION MANUFACTURING CORP.,0,US,Denver,CO,Denver County,B,3,3,3,0,fl:ra_ln:holliday-2,1,Randall A. Holliday,fl:go_ln:schnare-1,1,Gordon Graham Schnare,fl:ro_ln:parker-9,1,Robert M. Parker,,,,,,,,,,,,,,,,,,,0
6671945,2004,10/079085,2002,1,1,1,1,1,"VISHAY INTERTECHNOLOGY, INC.",0,US,Malvern,PA,Chester,H,3,3,3,0,fl:ge_ln:gerber-3,1,George V. Gerber,fl:an_ln:troianello-1,1,Anthony E. Troianello,fl:ha_ln:goldberger-1,1,Haim Goldberger,,,,,,,,,,,,,,,,,,,0
6671946,2004,09/462306,2000,1,1,1,1,1,"MATSUSHITA ELECTRIC INDUSTRIAL CO., LTD.",0,JP,Osaka,,,B,4,4,3,1,fl:sh_ln:kadota-4,1,Shozo Kadota,fl:mo_ln:higuchi-1,1,Motohiro Higuchi,fl:ma_ln:morioka-8,1,Manabu Morioka,fl:ma_ln:fujiyama-5,0,Masami Fujiyama,,,,,,,,,,,,,,,,0
6671947,2004,10/020316,2001,1,1,1,1,1,INTEL CORPORATION,0,US,Santa Clara,CA,Santa Clara,H,1,1,1,0,fl:ma_ln:bohr-2,1,Mark Bohr,,,,,,,,,,,,,,,,,,,,,,,,,0
6671948,2004,09/681066,2000,1,1,1,1,1,GENERAL ELECTRIC COMPANY,0,US,Niskayuna,NY,Schenectady County,H,4,4,4,0,fl:wi_ln:burdick-1,1,"William Edward Burdick, Jr.",fl:ja_ln:rose-20,1,James Wilson Rose,fl:ke_ln:durocher-1,1,Kevin Matthew Durocher,fl:ra_ln:fillion-1,1,Raymond Albert Fillion,,,,,,,,,,,,,,,,0
6671949,2004,09/808086,2001,1,1,1,1,1,"MATSUSHITA ELECTRIC WORKS, LTD.",0,JP,Osaka,,,H,3,1,1,0,fl:hi_ln:yoshioka-28,1,Hirokazu Yoshioka,fl:no_ln:yoshida-28,,Norio Yoshida,fl:ke_ln:tanaka-25,,Kenichiro Tanaka,,,,,,,,,,,,,,,,,,,0
6671950,2004,09/901373,2001,1,1,1,1,1,"PPG INDUSTRIES OHIO, INC.",0,US,Cleveland,OH,Cuyahoga,H,2,2,2,0,fl:la_ln:sturni-1,1,Lance C. Sturni,fl:ke_ln:olson-29,1,Kevin C. Olson,,,,,,,,,,,,,,,,,,,,,,0
6671951,2004,09/975780,2001,1,1,1,1,1,"MATSUSHITA ELECTRIC INDUSTRIAL CO., LTD.",0,JP,,,,H,7,6,6,0,fl:to_ln:nishii-4,1,Toshihiro Nishii,fl:sh_ln:yamane-6,1,Shigeru Yamane,fl:sh_ln:nakamura-37,1,Shinji Nakamura,fl:hi_ln:hayashi-41,1,Hidenori Hayashi,fl:to_ln:fujimoto-14,1,Toru Fujimoto,fl:to_ln:okada-52,1,Toshiharu Okada,fl:iz_ln:nakai-2,,Izuru Nakai,,,,,,,0
6671952,2004,10/080680,2002,1,1,1,1,1,"STAR MICRONICS CO., LTD.",0,JP,Shizuoka,,,H,1,0,0,0,fl:ka_ln:ono-42,,Kazuyasu Ono,,,,,,,,,,,,,,,,,,,,,,,,,0
6671953,2004,10/039856,2001,1,1,1,1,1,"BWX TECHNOLOGIES, INC.",0,US,Lynchburg,VA,Lynchburg city,H,2,1,1,0,fl:mi_ln:mcaninch-1,1,Michael D. McAninch,fl:ja_ln:hatmaker-3,,James G. Hatmaker,,,,,,,,,,,,,,,,,,,,,,0
6671954,2004,09/816215,2001,1,1,1,1,1,YAZAKI CORPORATION,0,JP,Tokyo,,,B,1,1,1,0,fl:yo_ln:nomoto-7,1,Yoshiaki Nomoto,,,,,,,,,,,,,,,,,,,,,,,,,0
6671955,2004,10/117933,2002,1,1,1,1,1,ALFING KESSLER SONDERMASCHINEN GMBH,0,DE,Aalen,,,B,1,0,0,0,fl:eb_ln:hugler-1,,Eberhard Hugler,,,,,,,,,,,,,,,,,,,,,,,,,0
6671956,2004,09/881568,2001,1,1,1,1,1,KOREA INSTITUTE OF MACHINERY & MATERIALS,0,KR,,,,B,3,2,2,0,fl:wo_ln:park-127,1,Won-Wook Park,fl:by_ln:moon-9,1,Byoung-Gi Moon,fl:ha_ln:kim-13,,Ha-Sik Kim,,,,,,,,,,,,,,,,,,,0
6671957,2004,10/224935,2002,1,0,0,1,1,,0,,,,,B,1,1,1,0,fl:ma_ln:diels-1,1,Manfred Diels,,,,,,,,,,,,,,,,,,,,,,,,,
6671958,2004,09/965065,2001,1,1,1,1,1,"METSO PAPER, INC.",0,FI,Helsinki,,,B,2,2,2,0,fl:ee_ln:savolainen-1,1,Eero Savolainen,fl:jo_ln:snellman-1,1,Jorma Snellman,,,,,,,,,,,,,,,,,,,,,,0
6671959,2004,10/179559,2002,1,0,0,1,1,,0,,,,,B,1,1,1,0,fl:mi_ln:skaggs-4,1,Michael D. Skaggs,,,,,,,,,,,,,,,,,,,,,,,,,
6671960,2004,10/147106,2002,1,1,1,1,1,IZUMI PRODUCTS COMPANY,0,JP,Nagano,,,B,3,2,2,0,fl:ky_ln:kawafune-1,1,Kyoichi Kawafune,fl:ts_ln:nakano-7,1,Tsuyoshi Nakano,fl:hi_ln:uchiyama-21,,Hiromi Uchiyama,,,,,,,,,,,,,,,,,,,0
6671961,2004,09/723425,2000,1,1,1,1,1,KONINKLIJKE PHILIPS ELECTRONICS N.V.,0,NL,Eindhoven,,,B,3,3,2,1,fl:ro_ln:santhagensvaneibergen-1,1,Robert Alexander Santhagens Van Eibergen,fl:jo_ln:pragt-5,0,Johan Pragt,fl:ja_ln:zuidervaart-1,1,Jasper Zuidervaart,,,,,,,,,,,,,,,,,,,0
6671962,2004,09/873770,2001,1,0,0,1,1,,0,,,,,B,1,1,1,0,fl:ab_ln:watamura-1,1,Abe Watamura,,,,,,,,,,,,,,,,,,,,,,,,,
6671963,2004,10/162047,2002,1,0,0,1,1,,0,,,,,B,1,0,0,0,fl:yu_ln:huang-147,,Yu-Hsin Huang,,,,,,,,,,,,,,,,,,,,,,,,,
6671964,2004,09/975536,2001,1,0,0,1,1,,0,,,,,B,1,1,0,1,fl:le_ln:ruiz-3,0,Lenscott F. Ruiz,,,,,,,,,,,,,,,,,,,,,,,,,
6671965,2004,10/034417,2001,1,1,1,1,1,UNITED TECHNOLOGIES CORPORATION,0,US,Hartford,CT,Hartford,B,3,3,3,0,fl:re_ln:clemens-1,1,Reade R. Clemens,fl:di_ln:shah-11,1,Dilip M. Shah,fl:da_ln:roe-6,1,David Lee Roe,,,,,,,,,,,,,,,,,,,0
6671966,2004,10/038013,2001,1,1,1,1,1,CALVIN R. MACKAY,1,US,Provo,UT,Utah,B,1,1,1,0,fl:jo_ln:lewis-43,1,John Bradford Lewis,,,,,,,,,,,,,,,,,,,,,,,,,0
6671967,2004,10/162328,2002,1,0,0,1,1,,0,,,,,B,1,0,0,0,fl:yu_ln:huang-147,,Yu-Hsin Huang,,,,,,,,,,,,,,,,,,,,,,,,,
6671968,2004,10/058139,2002,1,0,0,1,1,,0,,,,,B,1,1,1,0,fl:st_ln:shannon-6,1,Stephen Shannon,,,,,,,,,,,,,,,,,,,,,,,,,
6671969,2004,10/016944,2001,1,1,1,1,1,PORTER-CABLE CORPORATION,0,US,Jackson,TN,Madison,B,3,3,3,0,fl:al_ln:phillips-21,1,Alan Phillips,fl:jo_ln:schnell-2,1,John W. Schnell,fl:jo_ln:beville-1,1,John Beville,,,,,,,,,,,,,,,,,,,0
6671970,2004,10/058001,2002,1,1,1,1,1,CANPACIFIC ENGINEERING INC.,0,CA,Delta,BC,,B,1,1,1,0,fl:wu_ln:chong-2,1,Wun C. Chong,,,,,,,,,,,,,,,,,,,,,,,,,0
6671971,2004,10/423719,2003,1,0,0,1,1,,0,,,,,G,1,1,1,0,fl:da_ln:albert-7,1,David M. Albert,,,,,,,,,,,,,,,,,,,,,,,,,
6671972,2004,10/108759,2002,1,1,1,1,1,DR. JOHANNES HEIDENHAIN GMBH,0,DE,Traunreut,,,G,3,3,3,0,fl:jo_ln:mitterreiter-1,1,Johann Mitterreiter,fl:jo_ln:lahr-5,1,Johann Lahr,fl:di_ln:richter-4,1,Dietmar Richter,,,,,,,,,,,,,,,,,,,0
6671973,2004,10/142204,2002,1,1,1,1,1,MITUTOYO CORPORATION,0,JP,Kawasaki,,,G,2,1,0,1,fl:fu_ln:takemura-3,,Fumihiro Takemura,fl:mi_ln:katayama-13,0,Minoru Katayama,,,,,,,,,,,,,,,,,,,,,,0
6671974,2004,10/104174,2002,1,0,0,1,1,,0,,,,,G,1,0,0,0,fl:ve_ln:polk-1,,"Vess E. Polk, Jr.",,,,,,,,,,,,,,,,,,,,,,,,,
6671975,2004,10/014956,2001,1,0,0,1,1,,0,,,,,G,1,1,1,0,fl:c._ln:hennessey-1,1,C. William Hennessey,,,,,,,,,,,,,,,,,,,,,,,,,
6671976,2004,10/217605,2002,1,1,1,1,1,MITUTOYO CORPORATION,0,JP,Kawasaki,,,G,4,4,4,0,fl:se_ln:takahashi-8,1,Seigo Takahashi,fl:ma_ln:suzuki-25,1,Masamichi Suzuki,fl:ko_ln:sasaki-28,1,Kouji Sasaki,fl:yo_ln:shiraishi-5,1,Yoshiaki Shiraishi,,,,,,,,,,,,,,,,0
6671977,2004,09/902791,2001,1,1,1,1,1,BOEMAR INC.,0,VG,Road Town,,,F,1,1,1,0,fl:ba_ln:beaumont-1,1,Bart Donald Beaumont,,,,,,,,,,,,,,,,,,,,,,,,,0
6671978,2004,10/292531,2002,1,0,0,1,1,,0,,,,,F,2,2,1,1,fl:ia_ln:mcgowan-1,1,Ian McGowan,yiti95pbr627p7j8e04lpjt2y,0,Laura Tartaro-McGowan,,,,,,,,,,,,,,,,,,,,,,
6671979,2004,10/061785,2002,1,0,0,1,1,,0,,,,,A,1,1,1,0,fl:ve_ln:cardarelli-1,1,Venanzio Cardarelli,,,,,,,,,,,,,,,,,,,,,,,,,
6671980,2004,10/195376,2002,1,0,0,1,1,,0,,,,,A,1,1,1,0,fl:ku_ln:liu-99,1,Kun-Chung Liu,,,,,,,,,,,,,,,,,,,,,,,,,
6671981,2004,09/921957,2001,1,1,1,1,1,"JEFFREY S. BROOKS, INC.",0,US,Creve Coeur,MO,St. Louis,A,1,1,1,0,fl:je_ln:brooks-10,1,Jeffrey S. Brooks,,,,,,,,,,,,,,,,,,,,,,,,,0
6671982,2004,09/797718,2001,1,1,1,1,1,BENETTON GROUP S.P.A.,0,IT,Ponzano,,,A,1,1,1,0,fl:fr_ln:caeran-1,1,Francesco Caeran,,,,,,,,,,,,,,,,,,,,,,,,,0
6671983,2004,10/003664,2001,1,1,1,1,1,BOARD OF CONTROL OF MICHIGAN TECHNOLOGICAL UNIVERSITY,0,US,Houghton,MI,Houghton,E,2,2,2,0,fl:ph_ln:quenzi-3,1,Philip J. Quenzi,fl:ru_ln:alger-1,1,Russell Alger,,,,,,,,,,,,,,,,,,,,,,0
6671984,2004,10/093243,2002,1,0,0,1,1,,0,,,,,E,1,1,1,0,fl:da_ln:larson-49,1,David Larson,,,,,,,,,,,,,,,,,,,,,,,,,
6671985,2004,10/181472,2002,1,1,1,1,1,SEB S.A.,0,FR,Écully,,,D,1,1,1,0,fl:je_ln:bouleau-1,1,Jean-Paul Bouleau,,,,,,,,,,,,,,,,,,,,,,,,,0
6671986,2004,10/173523,2002,1,1,1,1,1,"REEVES COMPANY, INC.",0,US,Attleboro,MA,Bristol,A,1,1,1,0,fl:ro_ln:reeves-15,1,Robert J. Reeves,,,,,,,,,,,,,,,,,,,,,,,,,0
6671987,2004,09/506666,2000,1,1,1,1,1,"TUMI, INC.",0,US,South Plainfield,NJ,Middlesex,G,1,1,1,0,fl:ti_ln:fenton-2,1,Timm J. Fenton,,,,,,,,,,,,,,,,,,,,,,,,,0
6671988,2004,09/876213,2001,1,0,0,1,1,,0,,,,,G,1,1,1,0,fl:is_ln:cyrluk-1,1,Issac Cyrluk,,,,,,,,,,,,,,,,,,,,,,,,,
6671989,2004,10/172030,2002,1,0,0,1,1,,0,,,,,F,2,2,2,0,fl:ch_ln:vanek-1,1,Chester Vanek,fl:ab_ln:flatau-1,1,Abraham Flatau,,,,,,,,,,,,,,,,,,,,,,
6671990,2004,10/075744,2002,1,0,0,1,1,,0,,,,,F,1,1,1,0,fl:ve_ln:booth-2,1,Vern H. Booth,,,,,,,,,,,,,,,,,,,,,,,,,
6671991,2004,10/188429,2002,1,0,0,1,1,,0,,,,,F,1,0,0,0,fl:le_ln:danielson-2,,Lewis A. Danielson,,,,,,,,,,,,,,,,,,,,,,,,,
6671992,2004,09/577894,2000,1,1,1,1,1,AVIAN SYSTEMS CORPORATION,0,US,Louisville,KY,Jefferson,A,1,1,1,0,fl:ch_ln:price-25,1,Charles Stephen Price,,,,,,,,,,,,,,,,,,,,,,,,,0
6671993,2004,09/629937,2000,1,0,0,1,1,,0,,,,,A,1,1,1,0,fl:th_ln:routt-1,1,Thomas Routt,,,,,,,,,,,,,,,,,,,,,,,,,
6671994,2004,10/163352,2002,1,0,0,1,1,,0,,,,,A,1,1,1,0,fl:da_ln:klein-39,1,Darrel J. Klein,,,,,,,,,,,,,,,,,,,,,,,,,
6671995,2004,10/137276,2002,1,0,0,1,1,,0,,,,,A,1,1,1,0,fl:pa_ln:harkin-3,1,Pat Harkin,,,,,,,,,,,,,,,,,,,,,,,,,
6671996,2004,10/202144,2002,1,1,1,1,1,"BASSDAY CO., LTD.",0,JP,Toyokawa,,,A,1,0,0,0,fl:ki_ln:ito-14,,Kiyoshi Ito,,,,,,,,,,,,,,,,,,,,,,,,,0
6671997,2004,10/165919,2002,1,0,0,1,1,,0,,,,,A,1,1,1,0,fl:pe_ln:lindgren-6,1,Peter B. Lindgren,,,,,,,,,,,,,,,,,,,,,,,,,
6671998,2004,10/314463,2002,1,0,0,1,1,,0,,,,,A,1,1,1,0,fl:gl_ln:lawrence-1,1,Glenn Lawrence,,,,,,,,,,,,,,,,,,,,,,,,,
6671999,2004,10/162002,2002,1,0,0,1,1,,0,,,,,A,1,1,1,0,fl:ca_ln:doucette-1,1,Carl Doucette,,,,,,,,,,,,,,,,,,,,,,,,,
6672000,2004,10/205339,2002,1,0,0,1,1,,0,,,,,A,1,1,1,0,fl:ha_ln:aesch-1,1,"Harold W. Aesch, Jr.",,,,,,,,,,,,,,,,,,,,,,,,,
6672001,2004,09/193559,1998,1,1,1,1,1,BOARD OF REGENTS OF THE UNIVERSITY OF NEBRASKA,0,US,Lincoln,NE,Lancaster,C,4,3,3,0,fl:yu_ln:ali-1,1,Yusuf Ali,fl:vi_ln:ghorpade-1,,Viswas M. Ghorpade,fl:ro_ln:weber-32,1,Robert Weber,fl:mi_ln:hanna-8,1,Milford Hanna,,,,,,,,,,,,,,,,0
6672002,2004,09/830397,2001,1,0,0,1,1,,0,,,,,A,1,1,0,1,5dgh6ravv90l65vpsg9o35ws7,0,Marie Gumpper,,,,,,,,,,,,,,,,,,,,,,,,,
6672003,2004,10/165137,2002,1,0,0,1,1,,0,,,,,A,1,0,0,0,fl:ho_ln:park-180,,Hong Ku Park,,,,,,,,,,,,,,,,,,,,,,,,,
6672004,2004,10/337582,2003,1,1,1,1,1,"SOUTHPAC TRUST INTERNATIONAL, INC.",0,US,Edwardsville,IL,Madison,A,1,1,1,0,fl:do_ln:weder-1,1,Donald E. Weder,,,,,,,,,,,,,,,,,,,,,,,,,0
6672005,2004,10/447601,2003,1,1,1,1,1,"SOUTHPAC TRUST INTERNATIONAL, INC.",0,US,,KS,Decatur County,A,6,6,6,0,fl:do_ln:weder-1,1,Donald E. Weder,fl:wi_ln:straeter-2,1,William F. Straeter,fl:jo_ln:straeter-1,1,Joseph G. Straeter,fl:mi_ln:king-14,1,Michael J. King,fl:fr_ln:craig-1,1,Franklin J. Craig,fl:mi_ln:klemme-1,1,Michael R. Klemme,,,,,,,,,,0
6672006,2004,10/449319,2003,1,1,1,1,1,"SOUTHPAC TRUST INTERNATIONAL, INC.",0,US,,KS,Decatur County,A,6,6,6,0,fl:do_ln:weder-1,1,Donald E. Weder,fl:wi_ln:straeter-2,1,William F. Straeter,fl:jo_ln:straeter-1,1,Joseph G. Straeter,fl:mi_ln:king-14,1,Michael J. King,fl:fr_ln:craig-1,1,Franklin J. Craig,fl:mi_ln:klemme-1,1,Michael R. Klemme,,,,,,,,,,0
6672007,2004,10/270634,2002,1,0,0,1,1,,0,,,,,A,1,1,0,1,fl:ya_ln:lai-50,0,Yang Song Lai,,,,,,,,,,,,,,,,,,,,,,,,,
6672008,2004,09/899457,2001,1,1,1,1,1,"MTR, INC.",0,US,Brookings,SD,Brookings,E,2,2,2,0,fl:ed_ln:luetzow-1,1,Edwin J. Luetzow,fl:ri_ln:luetzow-1,1,Richard L. Luetzow,,,,,,,,,,,,,,,,,,,,,,0
6672009,2004,09/703533,2000,1,1,1,1,1,MARVIN LUMBER AND CEDAR COMPANY,0,US,Warroad,MN,Roseau County,E,2,2,1,1,fl:le_ln:wong-8,1,Lenny Wong,fl:le_ln:hendrickson-1,0,Leslie B. Hendrickson,,,,,,,,,,,,,,,,,,,,,,0
6672010,2004,09/670431,2000,1,1,1,1,1,"ROTO FRANK OF AMERICA, INC.",0,US,Essex,CT,Middlesex,E,2,2,2,0,fl:st_ln:gledhill-1,1,Steven Anthony Gledhill,fl:to_ln:dallas-1,1,Tobias Peter Dallas,,,,,,,,,,,,,,,,,,,,,,0
6672011,2004,09/905694,2001,1,1,1,1,1,SOLIPSYS CORPORATION,0,US,Laurel,MD,Prince George's,E,3,3,2,1,fl:pa_ln:garner-1,0,Paul N. Garner,fl:ly_ln:adams-6,1,Lynn J. Adams,fl:ch_ln:richards-9,1,Charles P. Richards,,,,,,,,,,,,,,,,,,,0
6672012,2004,10/043813,2002,1,1,1,1,1,AMERICAN METAL PRODUCTS COMPANY,0,US,Niles,MI,Berrien County,E,6,6,5,1,fl:go_ln:bahroos-1,1,Gobind Bahroos,fl:da_ln:eisenbraun-1,1,David Eisenbraun,fl:da_ln:ford-8,0,Daniel Ford,fl:st_ln:gibbons-4,1,Stephen Gibbons,fl:di_ln:katsamberis-1,1,Dimitris Katsamberis,fl:de_ln:maiello-1,1,Dennis R. Maiello,,,,,,,,,,0
6672013,2004,09/705077,2000,1,1,1,1,1,OTIS ELEVATOR COMPANY,0,US,Farmington,CT,Hartford,B,7,7,7,0,fl:th_ln:glassey-1,1,Thomas E. Glassey,fl:le_ln:adifon-1,1,Leandre Adifon,fl:th_ln:landry-1,1,Thomas E. Landry,fl:br_ln:swaybill-1,1,Bruce P. Swaybill,fl:ri_ln:fargo-1,1,Richard N. Fargo,fl:ji_ln:rivera-1,1,Jim Rivera,fl:br_ln:st.pierre-1,1,Bruce St. Pierre,,,,,,,0
6672014,2004,10/216763,2002,1,0,0,1,1,,0,,,,,E,1,1,1,0,fl:te_ln:jones-16,1,Terry V. Jones,,,,,,,,,,,,,,,,,,,,,,,,,
6672015,2004,09/816656,2001,1,1,1,1,1,MENARD SOLTRAITEMENT,0,FR,Nozay,,,E,1,1,1,0,fl:je_ln:cognon-1,1,Jean-Marie Cognon,,,,,,,,,,,,,,,,,,,,,,,,,0
6672016,2004,09/822980,2001,1,0,0,1,1,,0,,,,,E,1,1,1,0,fl:la_ln:janesky-1,1,Lawrence M. Janesky,,,,,,,,,,,,,,,,,,,,,,,,,
6672017,2004,10/154521,2002,1,0,0,1,1,,0,,,,,E,1,1,1,0,fl:da_ln:larson-8,1,Daniel Larson,,,,,,,,,,,,,,,,,,,,,,,,,
6672018,2004,09/975572,2001,1,0,0,1,1,,0,,,,,E,1,1,1,0,fl:je_ln:shingleton-1,1,Jefferson Shingleton,,,,,,,,,,,,,,,,,,,,,,,,,
6672019,2004,10/175386,2002,1,1,1,1,1,VOLLACK PARKHAUS AG,0,DE,Karlsruhe,,,E,1,0,0,0,fl:ju_ln:wenz-1,,Jürgen Otto Wenz,,,,,,,,,,,,,,,,,,,,,,,,,0
6672020,2004,10/099108,2002,1,1,1,1,1,THE BILCO COMPANY,0,US,West Haven,CT,New Haven County,E,2,2,2,0,fl:st_ln:cermola-1,1,Steven G. Cermola,fl:ga_ln:dabrowski-1,1,Gary P. Dabrowski,,,,,,,,,,,,,,,,,,,,,,0