patent_number,grant_year,application_number,application_year,d_inventor,d_assignee,d_location,d_application,d_ipc,assignee,assignee_ind,country,city,state,county,ipc_section,team_size,inventors,men_inventors,women_inventors,inventor_id1,male_flag1,inventor_name1,inventor_id2,male_flag2,inventor_name2,inventor_id3,male_flag3,inventor_name3,inventor_id4,male_flag4,inventor_name4,inventor_id5,male_flag5,inventor_name5,inventor_id6,male_flag6,inventor_name6,inventor_id7,male_flag7,inventor_name7,inventor_id8,male_flag8,inventor_name8,inventor_id9,male_flag9,inventor_name9,assignee_sequence
7155746,2007,2002/10330514,2002,1,1,1,1,1,"KIMBERLY-CLARK WORLDWIDE, INC.",0,US,Neenah,WI,Winnebago,A,3,2,2,0,fl:ph_ln:schorr-2,1,Phillip A. Schorr,fl:le_ln:jameson-2,1,Lee Kirby Jameson,fl:va_ln:sharma-2,,Varunesh Sharma,,,,,,,,,,,,,,,,,,,0
7155747,2007,2002/10245007,2002,1,1,1,1,1,"BHC ENGINEERING, LP",0,US,Orlando,FL,Orange,A,1,1,1,0,fl:gr_ln:baker-14,1,Gregg S. Baker,,,,,,,,,,,,,,,,,,,,,,,,,0
7155748,2007,2004/10816359,2004,1,1,1,1,1,KOHLER CO.,0,US,Kohler,WI,Sheboygan,A,2,2,2,0,fl:er_ln:vierkant-1,1,"Erich C. Vierkant, III",fl:da_ln:halloran-2,1,Daniel N. Halloran,,,,,,,,,,,,,,,,,,,,,,0
7155749,2007,2004/10818523,2004,1,0,0,1,1,,0,,,,,A,2,2,1,1,fl:id_ln:gelbart-1,0,Ida Gelbart,fl:ma_ln:goldman-6,1,Mark E. Goldman,,,,,,,,,,,,,,,,,,,,,,
7155750,2007,2004/10901129,2004,1,1,1,1,1,"NAKATOMI INDUSTRIAL CO., LTD.",0,JP,Shinagawa,,,E,1,1,1,0,fl:sh_ln:imaizumi-5,1,Shunichi Imaizumi,,,,,,,,,,,,,,,,,,,,,,,,,0
7155751,2007,2004/11009348,2004,1,0,0,1,1,,0,,,,,E,1,1,1,0,fl:br_ln:antunez-1,1,Bruce A. Antunez,,,,,,,,,,,,,,,,,,,,,,,,,
7155752,2007,2004/10877167,2004,1,0,0,1,1,,0,,,,,E,1,1,1,0,fl:br_ln:feda-1,1,Brian Feda,,,,,,,,,,,,,,,,,,,,,,,,,
7155753,2007,2002/10166166,2002,1,1,1,1,1,AISIN SEIKI KABUSHIKI KAISHA,0,JP,Kariya,,,E,4,4,3,1,fl:ko_ln:murakami-15,1,Kouji Murakami,fl:sh_ln:teranishi-5,1,Shunichi Teranishi,fl:mi_ln:ohara-3,0,Mitsuhiro Ohara,fl:ta_ln:muto-11,1,Takashi Muto,,,,,,,,,,,,,,,,0
7155754,2007,2004/10873092,2004,1,1,1,1,1,"JYC INTERNATIONAL, INC.",0,US,Houston,TX,Harris County,A,1,1,0,1,fl:ji_ln:chung-6,0,Jing-Yau Chung,,,,,,,,,,,,,,,,,,,,,,,,,0
7155755,2007,2004/10896446,2004,1,1,1,1,1,COLIVIER PTY LTD.,0,AU,Fremantle,,,A,1,1,1,0,fl:ge_ln:olivier-2,1,Gerard Olivier,,,,,,,,,,,,,,,,,,,,,,,,,0
7155756,2007,2004/10711350,2004,1,0,0,1,1,,0,,,,,E,1,1,1,0,fl:br_ln:helder-1,1,Bruce A. Helder,,,,,,,,,,,,,,,,,,,,,,,,,
7155757,2007,2004/10773999,2004,1,0,0,1,1,,0,,,,,A,1,1,1,0,fl:pe_ln:zamora-1,1,"Pedro Zamora, Jr.",,,,,,,,,,,,,,,,,,,,,,,,,
7155758,2007,2002/10199648,2002,1,1,1,1,1,JOSEPH J. BERKE,1,US,Beverly Hills,MI,Oakland,E,2,2,2,0,fl:jo_ln:berke-2,1,Joseph J. Berke,fl:ch_ln:michael-13,1,Charles T. Michael,,,,,,,,,,,,,,,,,,,,,,0
7155759,2007,2004/10820192,2004,1,0,0,1,1,,0,,,,,A E,1,1,0,1,fl:vi_ln:milne-1,0,Victoria Milne,,,,,,,,,,,,,,,,,,,,,,,,,
7155760,2007,2003/10624202,2003,1,1,1,1,1,MCALPINE & COMPANY LIMITED,0,GB,,,,E,1,1,1,0,fl:ja_ln:mcalpine-3,1,James Kenneth McAlpine,,,,,,,,,,,,,,,,,,,,,,,,,0
7155761,2007,2003/10382098,2003,1,1,1,1,1,"LANE FURNITURE INDUSTRIES, INC.",0,US,Tupelo,MS,Lee,A,1,1,0,1,fl:ja_ln:derose-1,0,James DeRose,,,,,,,,,,,,,,,,,,,,,,,,,0
7155762,2007,2005/11054634,2005,1,0,0,1,1,,0,,,,,A,1,1,1,0,fl:la_ln:harrow-1,1,Lawrence Harrow,,,,,,,,,,,,,,,,,,,,,,,,,
7155763,2007,2003/10392013,2003,1,0,0,1,1,,0,,,,,A,1,1,1,0,fl:to_ln:north-3,1,Toya J. North,,,,,,,,,,,,,,,,,,,,,,,,,
7155764,2007,2005/11030996,2005,1,1,0,1,1,TRAVERSE RESCUE LLC,0,,,,,A F,1,1,1,0,fl:ra_ln:sawatzky-1,1,Randal G. Sawatzky,,,,,,,,,,,,,,,,,,,,,,,,,0
7155765,2007,2003/10685298,2003,1,1,1,1,1,"TEMPUR-PEDIC MANAGEMENT, LLC",0,US,Lexington,KY,Fayette,A,1,1,1,0,fl:da_ln:fogg-2,1,David Fogg,,,,,,,,,,,,,,,,,,,,,,,,,0
7155766,2007,2004/11002604,2004,1,1,1,1,1,SCOTT TECHNOLOGY LLC,0,US,Oxford,CT,New Haven,A,2,2,2,0,fl:ed_ln:gilchrest-1,1,Edward Gilchrest,fl:ge_ln:riehm-1,1,George E. Riehm,,,,,,,,,,,,,,,,,,,,,,0
7155767,2007,2003/10620948,2003,1,1,1,1,1,HOYA CORPORATION,0,JP,,,,B,2,1,1,0,fl:hi_ln:kouno-12,1,Hiroshi Kouno,fl:ma_ln:kanahara-2,,Masahumi Kanahara,,,,,,,,,,,,,,,,,,,,,,0
7155768,2007,2003/10640943,2003,1,1,1,1,1,"PENGUIN WAX CO., LTD.",0,JP,Osaka,,,A,2,2,2,0,fl:is_ln:morita-2,1,Isao Morita,fl:ya_ln:ueda-20,1,Yasuhiro Ueda,,,,,,,,,,,,,,,,,,,,,,0
7155769,2007,2004/10984006,2004,1,0,0,1,1,,0,,,,,A,1,1,1,0,fl:ca_ln:baker-14,1,Catherine Marie Baker,,,,,,,,,,,,,,,,,,,,,,,,,
7155770,2007,2003/10464401,2003,1,1,1,1,1,SUNCAST CORPORATION,0,US,Batavia,IL,Kane County,A,2,2,2,0,fl:to_ln:anderson-29,1,Torrence Anderson,fl:ly_ln:rosine-1,1,Lyle A. Rosine,,,,,,,,,,,,,,,,,,,,,,0
7155771,2007,2003/10384712,2003,1,1,1,1,1,F.LLI RE S.P.A.,0,IT,Rho,,,A,1,1,1,0,fl:gi_ln:re-3,1,Giovanni Re,,,,,,,,,,,,,,,,,,,,,,,,,0
7155772,2007,2003/10660716,2003,1,1,1,1,1,"SAMSUNG GWANGJU ELECTRONICS CO., LTD.",0,KR,Gwangju,,,A,1,1,0,1,fl:yo_ln:lee-150,0,Yong Hee Lee,,,,,,,,,,,,,,,,,,,,,,,,,0
7155773,2007,2005/11249762,2005,1,1,1,1,1,ALFRED KAERCHER GMBH & CO. KG,0,DE,Winnenden,,,A,2,2,2,0,fl:ul_ln:haeussermann-1,1,Uli Haeussermann,fl:ro_ln:jeutter-1,1,Roland Jeutter,,,,,,,,,,,,,,,,,,,,,,0
7155774,2007,2003/10645156,2003,1,1,1,1,1,"SAMSUNG GWANGJU ELECTRONICS CO., LTD.",0,KR,Gwangju,,,A,1,1,1,0,fl:jo_ln:jung-133,1,Joo-Suck Jung,,,,,,,,,,,,,,,,,,,,,,,,,0
7155775,2007,2006/11347398,2006,1,0,0,1,1,,0,,,,,F,1,1,1,0,fl:do_ln:mockett-1,1,Douglas A. J. Mockett,,,,,,,,,,,,,,,,,,,,,,,,,
7155776,2007,2004/10822827,2004,1,1,1,1,1,"I-ONE INNOTECH CO., LTD",0,KR,Seojong-myeon,,,E,1,1,1,0,fl:bo_ln:park-60,1,Bong Mook Park,,,,,,,,,,,,,,,,,,,,,,,,,0
7155777,2007,2004/10883120,2004,1,1,1,1,1,"LEXMARK INTERNATIONAL, INC.",0,US,Lexington,KY,Fayette,E,3,3,3,0,fl:wi_ln:connors-3,1,William Michael Connors,fl:do_ln:spitz-2,1,Donald Norman Spitz,fl:gr_ln:washnock-1,1,Gregory Washnock,,,,,,,,,,,,,,,,,,,0
7155778,2007,2005/11029074,2005,1,1,1,1,1,"AMESBURY GROUP, INC.",0,US,Amesbury,MA,Essex,E,1,1,1,0,fl:ga_ln:newman-4,1,Gary Newman,,,,,,,,,,,,,,,,,,,,,,,,,0
7155779,2007,2005/10906429,2005,1,1,1,1,1,"LOGICAL DECISIONS, INC.",0,US,Baton Rouge,LA,East Baton Rouge Parish,B E,1,1,1,0,fl:gu_ln:watkins-1,1,Guy Watkins,,,,,,,,,,,,,,,,,,,,,,,,,0
7155780,2007,2004/10920760,2004,1,1,1,1,1,SUTECH TRADING LIMITED,0,VG,Road Town,,,E,1,1,0,1,fl:ru_ln:chen-50,0,Rui-Hao Chen,,,,,,,,,,,,,,,,,,,,,,,,,0
7155781,2007,2003/10540205,2003,1,1,1,1,1,KABUSHIKI KAISHA STRAWBERRY CORPORATION,0,JP,,,,E,5,4,3,1,fl:ts_ln:yamada-3,1,Tsuneo Yamada,fl:hi_ln:miyaoka-7,1,Hidekazu Miyaoka,fl:ka_ln:sakurai-24,0,Katsuichi Sakurai,fl:mi_ln:taninai-1,1,Minoru Taninai,fl:ko_ln:endo-7,,Koji Endo,,,,,,,,,,,,,0
7155782,2007,2004/10960178,2004,1,0,0,1,1,,0,,,,,A,1,1,1,0,fl:jo_ln:napurano-2,1,Joseph Napurano,,,,,,,,,,,,,,,,,,,,,,,,,
7155783,2007,2005/11095714,2005,1,1,1,1,1,NEWFREY LLC,0,US,Newark,DE,New Castle County,A,5,5,4,1,fl:ro_ln:nessel-1,0,Rosalind Nessel,fl:st_ln:benedetti-3,1,Steven M. Benedetti,fl:je_ln:slobodecki-2,1,Jeff Slobodecki,fl:jo_ln:giddings-3,1,Joshua J. Giddings,fl:ch_ln:fischer-19,1,Charles K. Fischer,,,,,,,,,,,,,0
7155784,2007,2004/10799276,2004,1,0,0,1,1,,0,,,,,A,1,1,0,1,fl:ja_ln:degroot-10,0,James DeGroot,,,,,,,,,,,,,,,,,,,,,,,,,
7155785,2007,2005/11258014,2005,1,1,1,1,1,KABUSHIKI KAISHA TOKAI RIKA DENKI SEISAKUSHO,0,JP,Miyoshi,,,A,1,1,1,0,fl:te_ln:muromachi-1,1,Tetsushi Muromachi,,,,,,,,,,,,,,,,,,,,,,,,,0
7155786,2007,2004/10966522,2004,1,1,1,1,1,ILLINOIS TOOL WORKS INC.,0,US,Glenview,IL,Cook,A,1,1,1,0,fl:mi_ln:grimm-4,1,Michael B. Grimm,,,,,,,,,,,,,,,,,,,,,,,,,0
7155787,2007,2005/11109014,2005,1,1,1,1,1,SAURER GMBH & CO. KG,0,DE,Mönchengladbach,,,D,1,1,1,0,fl:ma_ln:stundl-1,1,Mathias Stündl,,,,,,,,,,,,,,,,,,,,,,,,,0
7155788,2007,2005/11200022,2005,1,1,1,1,1,"LEADJACK AUTOMATION CO., LTD.",0,TW,Taichung,,,B,1,1,1,0,fl:we_ln:chang-8,1,Wen-Yu Chang,,,,,,,,,,,,,,,,,,,,,,,,,0
7155789,2007,2004/10899571,2004,1,0,0,1,1,,0,,,,,B,1,1,1,0,fl:do_ln:gracey-1,1,Doyle D. Gracey,,,,,,,,,,,,,,,,,,,,,,,,,
7155790,2007,2004/10828636,2004,1,1,1,1,1,"DESIGNED METAL CONNECTIONS, INC.",0,US,Gardena,CA,Los Angeles,B,2,1,1,0,fl:ki_ln:palejwala-1,,Kirit M. Palejwala,fl:gi_ln:sassoon-1,1,Gilad Sassoon,,,,,,,,,,,,,,,,,,,,,,0
7155791,2007,2004/10761730,2004,1,0,0,1,1,,0,,,,,B,1,1,1,0,fl:jo_ln:foster-22,1,John R. Foster,,,,,,,,,,,,,,,,,,,,,,,,,
7155792,2007,2005/11254174,2005,1,0,0,1,1,,0,,,,,B,1,1,1,0,fl:ke_ln:miller-67,1,Kelly Lee Miller,,,,,,,,,,,,,,,,,,,,,,,,,
7155793,2007,2004/10787352,2004,1,1,1,1,1,"FORD GLOBAL TECHNOLOGIES, LLC",0,US,Dearborn,MI,Wayne,B,1,1,1,0,fl:be_ln:simon-10,1,Bernard Simon,,,,,,,,,,,,,,,,,,,,,,,,,0
7155795,2007,2006/11355653,2006,1,1,1,1,1,LEONARD BLOOM,1,US,Towson,MD,Baltimore County,B,3,3,3,0,fl:mi_ln:abidin-1,1,Michael R. Abidin,fl:st_ln:lehmbeck-1,1,Steven P. Lehmbeck,fl:pa_ln:varga-1,1,Paul Varga,,,,,,,,,,,,,,,,,,,0
7155796,2007,2004/10709206,2004,1,1,1,1,1,"GENERALSPORTS TURF, LLC",0,US,Rochester,MI,Oakland,A B,1,1,1,0,fl:ch_ln:cook-28,1,Charles Cook,,,,,,,,,,,,,,,,,,,,,,,,,0
7155797,2007,2003/10516990,2003,1,0,0,1,1,,0,,,,,B,1,1,1,0,fl:by_ln:kim-300,1,Byung Shik Kim,,,,,,,,,,,,,,,,,,,,,,,,,
7155798,2007,2004/10896459,2004,1,1,1,1,1,PROFIL VERBINDUNGSTECHNIK GMBH & CO. KG,0,DE,,,,B F,2,2,2,0,fl:ru_ln:muller-5,1,Rudolf Muller,fl:ji_ln:babej-1,1,Jiri Babej,,,,,,,,,,,,,,,,,,,,,,0
7155799,2007,2004/10933154,2004,1,1,1,1,1,"DAVENPORT MACHINE, INC.",0,US,Rochester,NY,Monroe,B,2,1,1,0,fl:ro_ln:kruse-8,,Robert C. Kruse,fl:da_ln:revelle-1,1,David J. Revelle,,,,,,,,,,,,,,,,,,,,,,0
7155800,2007,2005/10906558,2005,1,1,1,1,1,GENERAL ELECTRIC COMPANY,0,US,Schenectady,NY,Schenectady County,B,3,3,3,0,fl:wi_ln:adis-1,1,William Edward Adis,fl:pa_ln:gill-2,1,Patrick H. Gill,fl:mi_ln:mack-1,1,Michael Dennis Mack,,,,,,,,,,,,,,,,,,,0
7155801,2007,2002/10494373,2002,1,1,1,1,1,BASF AKTIENGESELLSCHAFT,0,DE,Ludwigshafen,,,B F,2,1,1,0,fl:ul_ln:hammon-1,1,Ulrich Hammon,fl:ju_ln:schroeder-6,,Juergen Schroeder,,,,,,,,,,,,,,,,,,,,,,0
7155802,2007,2005/11235304,2005,1,0,0,1,1,,0,,,,,B,1,1,1,0,fl:da_ln:cronk-2,1,David Cronk,,,,,,,,,,,,,,,,,,,,,,,,,
7155803,2007,2004/10774493,2004,1,1,1,1,1,"MKS INSTRUMENTS, INC.",0,US,Andover,MA,Essex,G H,1,1,0,1,fl:st_ln:jonsson-5,0,Staffan Jonsson,,,,,,,,,,,,,,,,,,,,,,,,,0
7155804,2007,2003/10667014,2003,1,1,1,1,1,MOOG INC.,0,US,East Aurora,NY,Erie,H,1,1,1,0,fl:jo_ln:calico-1,1,John M. Calico,,,,,,,,,,,,,,,,,,,,,,,,,0
7155805,2007,2003/10732463,2003,1,1,1,1,1,DENSO CORPORATION,0,JP,Kariya,,,H,1,1,1,0,fl:sh_ln:nakamura-87,1,Shigenobu Nakamura,,,,,,,,,,,,,,,,,,,,,,,,,0
7155806,2007,2003/10686787,2003,1,1,1,1,1,EMS-EUROPE METALLI SUPERCONDUCTORS S.P.A.,0,IT,Firenze,,,H,1,1,1,0,fl:se_ln:rossi-2,1,Sergio Rossi,,,,,,,,,,,,,,,,,,,,,,,,,0
7155807,2007,2003/10651263,2003,1,1,1,1,1,HITACHI GLOBAL STORAGE TECHNOLOGIES NETHERLANDS B.V.,0,NL,Amsterdam,,,G H,5,5,4,1,fl:ta_ln:fu-3,1,Ta-Chang Fu,fl:ro_ln:lenicheck-1,1,Robert Lenicheck,fl:sa_ln:malek-3,1,Sattar Malek,fl:ki_ln:ungtae-1,0,Kim Ungtae,fl:st_ln:wong-18,1,Stanley Wong,,,,,,,,,,,,,0
7155808,2007,2004/10866742,2004,1,1,1,1,1,TDK CORPORATION,0,JP,Tokyo,,,G H,5,5,5,0,fl:te_ln:sasaki-11,1,Tetsuro Sasaki,fl:so_ln:koide-1,1,Soji Koide,fl:ei_ln:omata-2,1,Eiichi Omata,fl:ma_ln:sano-23,1,Masashi Sano,fl:no_ln:oyama-6,1,Nobuya Oyama,,,,,,,,,,,,,0
7155809,2007,2006/11401955,2006,1,1,1,1,1,SAE MAGNETICS (H.K.) LTD.,0,CN,Sha Tin,,,G,3,3,3,0,fl:yo_ln:sasaki-43,1,Yoshitaka Sasaki,fl:hi_ln:itoh-34,1,Hiroyuki Itoh,fl:ta_ln:kamigama-1,1,Takehiro Kamigama,,,,,,,,,,,,,,,,,,,1
7155810,2007,2003/10676472,2003,1,1,1,1,1,HITACHI GLOBAL STORAGE TECHNOLOGIES NETHERLANDS B.V.,0,NL,Amsterdam,,,G H,1,1,1,0,fl:mu_ln:pinarbasi-1,1,Mustafa Pinarbasi,,,,,,,,,,,,,,,,,,,,,,,,,0
7155811,2007,2004/10944958,2004,1,1,1,1,1,BLACK & DECKER INC.,0,US,Newark,DE,New Castle County,H,1,1,1,0,fl:re_ln:wang-17,1,Ren Hong Wang,,,,,,,,,,,,,,,,,,,,,,,,,0
7155812,2007,2003/10655466,2003,1,1,1,1,1,SANDIA CORPORATION,0,US,Albuquerque,NM,Bernalillo County,H,4,4,4,0,fl:ke_ln:peterson-10,1,Kenneth A. Peterson,fl:st_ln:rohde-7,1,Steven B. Rohde,fl:ke_ln:pfeifer-2,1,Kent B. Pfeifer,fl:ti_ln:turner-12,1,Timothy S. Turner,,,,,,,,,,,,,,,,0
7155813,2007,2004/10797999,2004,1,1,1,1,1,DATA I/O CORPORATION,0,US,Redmond,WA,King,B,1,1,1,0,fl:le_ln:bolotin-1,1,Lev M. Bolotin,,,,,,,,,,,,,,,,,,,,,,,,,0
7155814,2007,2003/10676978,2003,1,1,1,1,1,"FUJI PHOTO FILM CO., LTD.",0,JP,Yokohama,,,B,4,3,3,0,fl:hi_ln:yamamoto-96,,Hidetoshi Yamamoto,fl:ke_ln:ishikawa-11,1,Kenji Ishikawa,fl:yu_ln:ishihara-15,1,Yusuke Ishihara,fl:na_ln:okutsu-1,1,Naoki Okutsu,,,,,,,,,,,,,,,,0
7155815,2007,2004/10859114,2004,1,1,1,1,1,NOVAR GMBH,0,DE,,,,H,4,3,3,0,fl:an_ln:gernhardt-1,,Angelika Gernhardt,fl:th_ln:goulet-1,1,Thomas Goulet,fl:ca_ln:menzel-1,1,Carsten Menzel,fl:wa_ln:ollik-1,1,Waldemar Ollik,,,,,,,,,,,,,,,,0
7155816,2007,2003/10354972,2003,1,1,1,1,1,TDK CORPORATION,0,JP,Tokyo,,,H,3,3,3,0,fl:hi_ln:ninomiya-17,1,Hideaki Ninomiya,fl:ha_ln:nishino-1,1,Haruo Nishino,fl:ki_ln:hatanaka-4,1,Kiyoshi Hatanaka,,,,,,,,,,,,,,,,,,,0
7155817,2007,2004/10762452,2004,1,1,1,1,1,"MATSUSHITA ELECTRIC INDUSTRIAL CO., LTD.",0,JP,Osaka,,,H,5,5,5,0,fl:ju_ln:hada-2,1,Junichi Hada,fl:sh_ln:fukuda-30,1,Shozo Fukuda,fl:sh_ln:imafuku-4,1,Shigeki Imafuku,fl:ak_ln:noudo-1,1,Akira Noudo,fl:yo_ln:hattori-14,1,Yoshiyuki Hattori,,,,,,,,,,,,,0
7155818,2007,2004/10953158,2004,1,0,0,1,1,,0,,,,,H,1,0,0,0,fl:do_ln:smith-63,,Douglas Smith,,,,,,,,,,,,,,,,,,,,,,,,,
7155819,2007,2003/10612705,2003,1,1,1,1,1,INTEL CORPORATION,0,US,Santa Clara,CA,Santa Clara,H,2,2,2,0,fl:da_ln:mcconville-2,1,David McConville,fl:ma_ln:vininski-1,1,Mark Vininski,,,,,,,,,,,,,,,,,,,,,,0
7155820,2007,2003/10695302,2003,1,1,1,1,1,"MATSUSHITA ELECTRIC INDUSTRIAL CO., LTD.",0,JP,Osaka,,,H,7,6,5,1,fl:da_ln:andoh-1,1,Daizo Andoh,fl:fu_ln:echigo-1,1,Fumio Echigo,fl:ta_ln:nakamura-88,,Tadashi Nakamura,fl:ya_ln:nakatani-4,1,Yasuhiro Nakatani,fl:yo_ln:ueda-19,1,Yoji Ueda,fl:to_ln:nishiyama-20,0,Tousaku Nishiyama,fl:sh_ln:ochi-11,1,Shozo Ochi,,,,,,,0
7155821,2007,2004/10881588,2004,1,1,1,1,1,EMC CORPORATION,0,US,Hopkinton,MA,Middlesex,H,2,2,2,0,fl:st_ln:downes-1,1,Stuart D. Downes,fl:lo_ln:feinstein-1,1,Louis H. Feinstein,,,,,,,,,,,,,,,,,,,,,,0
7155822,2007,2004/10917670,2004,1,1,1,1,1,"HEWLETT-PACKARD DEVELOPMENT COMPANY, L.P.",0,US,Houston,TX,Harris County,H,2,2,1,1,fl:je_ln:decime-1,1,Jerry Decime,fl:br_ln:burget-1,0,Brenda Burget,,,,,,,,,,,,,,,,,,,,,,0
7155823,2007,2003/10636208,2003,1,1,1,1,1,SILVERBROOK RESEARCH PTY LTD,0,AU,Sydney,,,B H,1,1,0,1,fl:ki_ln:silverbrook-1,0,Kia Silverbrook,,,,,,,,,,,,,,,,,,,,,,,,,0
7155824,2007,2004/10802673,2004,1,1,1,1,1,"AMERICAN AXLE & MANUFACTURING, INC.",0,US,Detroit,MI,Wayne,B,1,1,1,0,fl:br_ln:prucher-1,1,Bryan Prucher,,,,,,,,,,,,,,,,,,,,,,,,,0
7155825,2007,2001/10466195,2001,1,1,1,1,1,LIND FINANCE & DEVELOPMENT AB,0,SE,Gothenburg,,,B F,1,1,1,0,fl:bj_ln:lind-1,1,Bjorn Lind,,,,,,,,,,,,,,,,,,,,,,,,,0
7155826,2007,2002/10478021,2002,1,1,1,1,1,PAUL MUELLER GMBH & CO. KG UNTERNEHMENSBETEILIGUNGEN,0,DE,Ahlen,,,B,1,1,1,0,fl:he_ln:wehrfritz-1,1,Heinz Wehrfritz,,,,,,,,,,,,,,,,,,,,,,,,,0
7155827,2007,2003/10695900,2003,1,1,1,1,1,"TORQUE-TRACTION TECHNOLOGIES, INC.",0,US,Maumee,OH,Lucas,B F,6,6,6,0,fl:ed_ln:stuart-1,1,Edward Eugene Stuart,fl:ti_ln:allmandinger-3,1,Timothy Bernard Allmandinger,fl:se_ln:hoefer-1,1,Sean Karl Hoefer,fl:ea_ln:irwin-1,1,Earl James Irwin,fl:pa_ln:nanua-1,1,Parvinder Singh Nanua,fl:gr_ln:maser-1,1,Gregory James Maser,,,,,,,,,,0
7155828,2007,2004/10936077,2004,1,1,1,1,1,"EVEREADY BATTERY COMPANY, INC.",0,US,Chesterfield,MO,St. Louis,B,4,3,3,0,fl:ra_ln:guimont-1,1,Raymond Guimont,fl:ma_ln:swanson-16,1,Matthew Swanson,fl:ha_ln:liu-75,,Hao-Chih Liu,fl:ye_ln:tao-4,1,Ye Tao,,,,,,,,,,,,,,,,0
7155829,2007,2005/11242034,2005,1,0,0,1,1,,0,,,,,B,1,1,0,1,fl:fu_ln:sun-24,0,Fu-Cheng Sun,,,,,,,,,,,,,,,,,,,,,,,,,
7155830,2007,2004/10984312,2004,1,1,1,1,1,"HONDA MOTOR CO., LTD.",0,JP,,,,B,3,3,3,0,fl:hi_ln:sasaki-33,1,Hideshi Sasaki,fl:ke_ln:hiratsuna-1,1,Kenjiro Hiratsuna,fl:hi_ln:uchitani-1,1,Hiroaki Uchitani,,,,,,,,,,,,,,,,,,,0
7155831,2007,2004/10889828,2004,1,1,1,1,1,"HON HAI PRECISION IND. CO., LTD.",0,TW,New Taipei,,,B,7,6,4,2,fl:gw_ln:huang-3,1,Gwo-Yan Huang,fl:ya_ln:xu-71,1,Yan Xu,fl:ch_ln:he-69,1,Chun He,fl:wu_ln:chen-18,,Wu-Kuang Chen,fl:ch_ln:hung-114,0,Chih-Chien Hung,fl:mu_ln:hsu-8,1,Mu-Chi Hsu,fl:yi_ln:chung-13,0,Yi-Ta Chung,,,,,,,1
7155832,2007,2005/11069799,2005,1,1,1,1,1,HUSQVARNA OUTDOOR PRODUCTS INC.,0,US,Augusta,GA,Richmond,B,4,4,4,0,fl:pa_ln:warfel-1,1,Paul Warfel,fl:st_ln:mckeithen-1,1,Steven McKeithen,fl:de_ln:zapanata-1,1,Dennis Zapanata,fl:wi_ln:keeton-2,1,William B. Keeton,,,,,,,,,,,,,,,,0
7155833,2007,2006/11376670,2006,1,1,1,1,1,"YAMCON, INC.",0,US,Rancho Santa Margarita,CA,Orange,G,2,2,2,0,fl:mi_ln:lemp-1,1,Michael Lemp,fl:mi_ln:hatalski-1,1,Michael Hatalski,,,,,,,,,,,,,,,,,,,,,,0
7155834,2007,2001/09909382,2001,1,0,0,1,1,,0,,,,,G,2,1,1,0,fl:ch_ln:palumbo-1,1,Charles Palumbo,fl:ed_ln:ohl-1,,Edwin A. Ohl,,,,,,,,,,,,,,,,,,,,,,
7155835,2007,2006/11356552,2006,1,1,1,1,1,TRIMBLE NAVIGATION LIMITED,0,US,Sunnyvale,CA,Santa Clara,G,2,2,2,0,fl:ji_ln:hayes-1,1,Jim Hayes,fl:ro_ln:mccarty-4,1,Robin McCarty,,,,,,,,,,,,,,,,,,,,,,0
7155836,2007,2004/10951913,2004,1,1,1,1,1,"SAMSUNG ELECTRONICS CO., LTD.",0,KR,Suwon-si,,,G,4,1,0,1,fl:wo_ln:kwon-53,,Woong Kwon,fl:ky_ln:roh-5,0,Kyung Shik Roh,fl:wo_ln:han-12,,Woo Sup Han,fl:yo_ln:shim-58,,Young Bo Shim,,,,,,,,,,,,,,,,0
7155837,2007,2005/11051467,2005,1,1,1,1,1,"SAMSUNG ELECTRONICS CO., LTD.",0,KR,Suwon-si,,,G,5,3,3,0,fl:wo_ln:cho-5,1,Woo-jong Cho,fl:se_ln:cho-151,,Seong Yun Cho,fl:ch_ln:park-207,1,Chan-Gook Park,fl:sa_ln:choi-44,1,Sang-on Choi,fl:wo_ln:lee-85,,Woo-Jong Lee,,,,,,,,,,,,,0
7155838,2007,2004/10806919,2004,1,1,1,1,1,"SE-KURE CONTROLS, INC.",0,US,Franklin Park,IL,Cook,A G,2,2,2,0,fl:ro_ln:leyden-1,1,Roger J. Leyden,fl:de_ln:hayes-7,1,Dennis Hayes,,,,,,,,,,,,,,,,,,,,,,0
7155839,2007,2005/11188167,2005,1,1,1,1,1,DR. JOHANNES HEIDENHAIN GMBH,0,DE,Traunreut,,,G,1,1,1,0,fl:re_ln:schopf-1,1,Reinhold Schopf,,,,,,,,,,,,,,,,,,,,,,,,,0
7155840,2007,2005/11082601,2005,1,0,0,1,1,,0,,,,,B G,1,1,1,0,fl:gr_ln:carbonaro-1,1,Gregory Carbonaro,,,,,,,,,,,,,,,,,,,,,,,,,
7155841,2007,2005/11091640,2005,1,1,1,1,1,"EARTH CARE PRODUCTS, INC.",0,US,Independence,KS,Montgomery,F,1,1,1,0,fl:an_ln:livingston-8,1,Andrew D. Livingston,,,,,,,,,,,,,,,,,,,,,,,,,0
7155842,2007,2002/10501085,2002,1,0,0,1,1,,0,,,,,H,1,1,1,0,fl:ra_ln:oliverpetri-1,1,Ralf Oliver Petri,,,,,,,,,,,,,,,,,,,,,,,,,
7155843,2007,2005/11196578,2005,1,1,1,1,1,AKEVA L.L.C.,0,US,Greensboro,NC,Guilford,A,1,1,1,0,fl:da_ln:meschan-1,1,David F. Meschan,,,,,,,,,,,,,,,,,,,,,,,,,0
7155844,2007,2004/10960949,2004,1,0,0,1,1,,0,,,,,A,1,1,0,1,fl:yi_ln:chu-30,0,Yi-Tien Chu,,,,,,,,,,,,,,,,,,,,,,,,,
7155845,2007,2002/10475933,2002,1,1,1,1,1,EXTEN.S,0,FR,Cholet,,,A,1,1,1,0,fl:je_ln:durand-15,1,Jean-Jacques Durand,,,,,,,,,,,,,,,,,,,,,,,,,0
7155846,2007,2004/10860801,2004,1,1,1,1,1,"NIKE, INC.",0,US,Beaverton,OR,Washington,A,2,2,2,0,fl:ch_ln:alfaro-1,1,Charlie Narito Alfaro,fl:br_ln:bainbridge-1,1,Bryant T. Bainbridge,,,,,,,,,,,,,,,,,,,,,,0
7155847,2007,2005/11258814,2005,1,1,1,1,1,"HONDA MOTOR CO., LTD.",0,JP,,,,E G,2,2,2,0,fl:ke_ln:kuroiwa-8,1,Kenji Kuroiwa,fl:ts_ln:mizoroke-1,1,Tsutomu Mizoroke,,,,,,,,,,,,,,,,,,,,,,0
7155848,2007,2003/10454471,2003,1,1,0,1,1,501413 ONTARIO LIMITED,0,,,,,G,2,2,2,0,fl:bi_ln:o'malley-1,1,Bill O'Malley,fl:ab_ln:klassen-1,1,Abram Klassen,,,,,,,,,,,,,,,,,,,,,,0
7155849,2007,2002/10467786,2002,1,0,0,1,1,,0,,,,,G,1,0,0,0,fl:jo_ln:hinterkeuser-1,,Josef Hinterkeuser,,,,,,,,,,,,,,,,,,,,,,,,,
7155850,2007,2004/10882584,2004,1,0,0,1,1,,0,,,,,G,2,2,1,1,fl:jo_ln:wilinsky-1,1,"John Wilinsky, Jr.",fl:be_ln:weihewilinsky-1,0,Beverly A. Weihe-Wilinsky,,,,,,,,,,,,,,,,,,,,,,
7155851,2007,2002/10343169,2002,1,1,1,1,1,DANTSU TEC INC.,0,JP,Tokyo,,,A G,1,1,1,0,fl:to_ln:ootsuka-4,1,Toshie Ootsuka,,,,,,,,,,,,,,,,,,,,,,,,,0
7155852,2007,2004/10820871,2004,1,0,0,1,1,,0,,,,,G,1,1,1,0,fl:mi_ln:vogler-2,1,Michael N. Vogler,,,,,,,,,,,,,,,,,,,,,,,,,
7155853,2007,2003/10689283,2003,1,1,1,1,1,"SOUTHERN IMPERIAL, INC.",0,US,Rockford,IL,Winnebago County,G,1,1,1,0,fl:th_ln:valiulis-1,1,Thomas E. Valiulis,,,,,,,,,,,,,,,,,,,,,,,,,0
7155854,2007,2005/11160529,2005,1,0,0,1,1,,0,,,,,B G,1,1,1,0,fl:ke_ln:dickinson-6,1,Kent Dickinson,,,,,,,,,,,,,,,,,,,,,,,,,
7155855,2007,2004/10763374,2004,1,1,1,1,1,HECKLER & KOCH GMBH,0,DE,Oberndorf am Neckar,,,F,2,2,2,0,fl:er_ln:mauch-1,1,Ernst Mauch,fl:mi_ln:schumacher-8,1,Michael Schumacher,,,,,,,,,,,,,,,,,,,,,,0
7155856,2007,2005/11099204,2005,1,1,1,1,1,"KIMBER IP, LLC",0,US,Yonkers,NY,Westchester,F,1,1,1,0,fl:pe_ln:hylenski-1,1,Peter J. Hylenski,,,,,,,,,,,,,,,,,,,,,,,,,0
7155857,2007,2004/10887403,2004,1,0,0,1,1,,0,,,,,F,1,1,1,0,fl:sa_ln:elder-1,1,Samuel F. Elder,,,,,,,,,,,,,,,,,,,,,,,,,
7155858,2007,2004/10979615,2004,1,0,0,1,1,,0,,,,,A,1,1,1,0,fl:wi_ln:caldwell-15,1,William Alfred Caldwell,,,,,,,,,,,,,,,,,,,,,,,,,
7155859,2007,2005/11039410,2005,1,0,0,1,1,,0,,,,,A,1,1,1,0,fl:tr_ln:brooks-7,1,Truman Brooks,,,,,,,,,,,,,,,,,,,,,,,,,
7155860,2007,2005/11229123,2005,1,0,0,1,1,,0,,,,,A,1,1,1,0,fl:ge_ln:ferguson-2,1,George William Ferguson,,,,,,,,,,,,,,,,,,,,,,,,,
7155861,2007,2004/10912860,2004,1,1,1,1,1,JAMISON DOOR COMPANY,0,US,Hagerstown,MD,Washington,E,2,2,2,0,fl:cu_ln:berry-2,1,Curtis Berry,fl:wi_ln:nichols-14,1,William B. Nichols,,,,,,,,,,,,,,,,,,,,,,0
7155862,2007,2003/10715249,2003,1,1,1,1,1,"AUTOMOTIVE COMPONENTS HOLDINGS, LLC",0,US,Dearborn,MI,Wayne,E,8,8,7,1,fl:je_ln:bourque-1,1,Jeffrey Gerard Bourque,fl:pa_ln:kolokowski-1,1,Paul Joseph Kolokowski,fl:mi_ln:lesle-1,1,Michael Lesle,fl:la_ln:lyke-1,1,Lawrence R. Lyke,fl:th_ln:payton-2,0,"Thomas William Payton, Jr.",fl:sc_ln:saxon-1,1,Scott Saxon,fl:ma_ln:tanksley-1,1,Marcus Tanksley,fl:ri_ln:weinert-2,1,Rick Weinert,,,,0
7155863,2007,2004/10804202,2004,1,1,1,1,1,GUARDIAN INDUSTRIES CORP.,0,US,Auburn Hills,MI,Oakland,E,4,4,4,0,fl:ke_ln:daniel-3,1,Kevin M. Daniel,fl:ro_ln:himebaugh-1,1,Robert Himebaugh,fl:ma_ln:schreiner-3,1,Mark A. Schreiner,fl:an_ln:billiu-1,1,Andrew Billiu,,,,,,,,,,,,,,,,0
7155864,2007,2003/10402405,2003,1,0,0,1,1,,0,,,,,E,1,1,1,0,fl:mi_ln:din-1,1,Michael W. Din,,,,,,,,,,,,,,,,,,,,,,,,,
7155865,2007,2003/10692521,2003,1,1,1,1,1,"CERTIFIED LUMBER, LLC",0,US,Oneonta,NY,Otsego,E,1,1,1,0,fl:ab_ln:rosenberg-1,1,Abraham Rosenberg,,,,,,,,,,,,,,,,,,,,,,,,,0
7155866,2007,2003/10342529,2003,1,1,1,1,1,CERTAINTEED CORPORATION,0,US,Valley Forge,PA,Chester,E,2,2,1,1,fl:wi_ln:bezubic-1,1,"William Paul Bezubic, Jr.",fl:cl_ln:brown-56,0,"Claude Brown, Jr.",,,,,,,,,,,,,,,,,,,,,,0
7155867,2007,2003/10626913,2003,1,1,1,1,1,"PARAGON AQUATICS, A DIVISION OF PENTAIR POOL PRODUCTS, INC.",0,US,Beekman,NY,Town of Beekman,E,2,2,2,0,fl:th_ln:saldarelli-1,1,Thomas A. Saldarelli,fl:je_ln:amato-2,1,Jerry Amato,,,,,,,,,,,,,,,,,,,,,,0
7155868,2007,2002/10306912,2002,1,1,1,1,1,JAMES HARDIE INTERNATIONAL FINANCE B.V.,0,NL,Amsterdam,,,E,2,2,2,0,fl:da_ln:cole-38,1,Dawn Cole,fl:we_ln:peng-85,1,Weiling Peng,,,,,,,,,,,,,,,,,,,,,,0
7155869,2007,2002/10072002,2002,1,1,1,1,1,SAINT-GOBAIN GLASS FRANCE,0,FR,Courbevoie,,,E,2,2,2,0,fl:kl_ln:wildenhain-1,1,Klaus Wildenhain,fl:ra_ln:linden-3,1,Ralf Linden,,,,,,,,,,,,,,,,,,,,,,0
7155870,2007,2004/10872126,2004,1,1,1,1,1,POWERLIGHT CORPORATION,0,US,Berkeley,CA,Alameda,E,1,1,1,0,fl:ch_ln:almy-2,1,Charles Almy,,,,,,,,,,,,,,,,,,,,,,,,,0
7155871,2007,2005/11321015,2005,1,1,1,1,1,TRU WOODS LIMITED,0,CN,Sha Tin,,,E,2,2,2,0,fl:no_ln:stone-1,1,Norman Stone,fl:so_ln:zhengxing-1,1,Song Zhengxing,,,,,,,,,,,,,,,,,,,,,,0
7155872,2007,2002/10313438,2002,1,0,0,1,1,,0,,,,,E,1,1,1,0,fl:la_ln:francom-1,1,Larry Francom,,,,,,,,,,,,,,,,,,,,,,,,,
7155873,2007,2004/10822353,2004,1,1,1,1,1,"NATIONAL OILWELL VARCO, L.P.",0,US,Houston,TX,Harris County,E,1,1,1,0,fl:an_ln:palidis-1,1,Anastasios Palidis,,,,,,,,,,,,,,,,,,,,,,,,,0
7155874,2007,2002/10468063,2002,1,0,0,1,1,,0,,,,,E,1,0,0,0,fl:da_ln:lee-52,,Dae-Jun Lee,,,,,,,,,,,,,,,,,,,,,,,,,