patent_number,grant_year,application_number,application_year,d_inventor,d_assignee,d_location,d_application,d_ipc,assignee,assignee_ind,country,city,state,county,ipc_section,team_size,inventors,men_inventors,women_inventors,inventor_id1,male_flag1,inventor_name1,inventor_id2,male_flag2,inventor_name2,inventor_id3,male_flag3,inventor_name3,inventor_id4,male_flag4,inventor_name4,inventor_id5,male_flag5,inventor_name5,inventor_id6,male_flag6,inventor_name6,inventor_id7,male_flag7,inventor_name7,inventor_id8,male_flag8,inventor_name8,inventor_id9,male_flag9,inventor_name9,assignee_sequence
8087094,2012,2006/11638293,2006,1,0,0,1,1,,0,,,,,A,1,1,0,1,fl:sv_ln:karasina-1,0,Svetlana Karasina,,,,,,,,,,,,,,,,,,,,,,,,,
8087095,2012,2007/11838515,2007,1,1,1,1,1,ASSOS OF SWITZERLAND GMBH,0,CH,,,,A,1,1,1,0,fl:ro_ln:maier-16,1,Roger Maier,,,,,,,,,,,,,,,,,,,,,,,,,0
8087096,2012,2005/11037749,2005,1,1,1,1,1,"GORE ENTERPRISE HOLDINGS, INC.",0,US,Newark,DE,New Castle County,A,4,4,2,2,fl:je_ln:klein-36,1,Jeffrey A. Klein,fl:mi_ln:napolitano-4,1,Michael J. Napolitano,fl:kr_ln:vonk-1,0,Kristy L. Vonk,fl:ma_ln:williams-141,0,Mark A. Williams,,,,,,,,,,,,,,,,0
8087097,2012,2008/12048799,2008,1,1,1,1,1,ASSOS OF SWITZERLAND GMBH,0,CH,,,,A,1,1,1,0,fl:ro_ln:maier-16,1,Roger Maier,,,,,,,,,,,,,,,,,,,,,,,,,0
8087098,2012,2008/12242434,2008,1,0,0,1,1,,0,,,,,A,4,4,2,2,fl:ju_ln:kimberly-1,0,Judy Kimberly,fl:ju_ln:serovich-1,0,Julie Serovich,fl:ja_ln:serovich-1,1,Jared Serovich,fl:ju_ln:serovich-2,1,Justin Serovich,,,,,,,,,,,,,,,,
8087099,2012,2008/11970000,2008,1,1,1,1,1,"SHOEI CO., LTD.",0,JP,Tokyo,,,A,1,1,1,0,fl:ak_ln:sawabe-2,1,Akira Sawabe,,,,,,,,,,,,,,,,,,,,,,,,,0
8087100,2012,2007/11944942,2007,1,1,1,1,1,"ITT MANUFACTURING ENTERPRISES, INC.",0,US,Wilmington,DE,New Castle,A,4,4,4,0,fl:ra_ln:aguero-1,1,Raymond Aguero,fl:to_ln:neff-2,1,Todd Neff,fl:wi_ln:garris-1,1,William Eric Garris,fl:ro_ln:holmes-5,1,Roy H. Holmes,,,,,,,,,,,,,,,,0
8087101,2012,2007/11939738,2007,1,0,0,1,1,,0,,,,,A,1,1,1,0,fl:ja_ln:ferguson-15,1,James Riddell Ferguson,,,,,,,,,,,,,,,,,,,,,,,,,
8087102,2012,2008/12290510,2008,1,0,0,1,1,,0,,,,,A,1,1,1,0,fl:mi_ln:kordecki-1,1,Michael E. Kordecki,,,,,,,,,,,,,,,,,,,,,,,,,
8087103,2012,2006/11581900,2006,1,0,0,1,1,,0,,,,,A,1,1,1,0,fl:mi_ln:leibfried-1,1,Michael R. Leibfried,,,,,,,,,,,,,,,,,,,,,,,,,
8087104,2012,2009/12380542,2009,1,0,0,1,1,,0,,,,,A,1,1,1,0,fl:ja_ln:reynolds-7,1,"James W. Reynolds, Jr.",,,,,,,,,,,,,,,,,,,,,,,,,
8087105,2012,2009/12623451,2009,1,1,1,1,1,"HOLD WELL INDUSTRIAL CO., LTD.",0,TW,Zhuolan Township,,,E,1,0,0,0,fl:yi_ln:tang-35,,Yi-Wen Tang,,,,,,,,,,,,,,,,,,,,,,,,,0
8087106,2012,2009/12398921,2009,1,0,0,1,1,,0,,,,,E,1,1,1,0,fl:ja_ln:mitchell-49,1,Jack B. Mitchell,,,,,,,,,,,,,,,,,,,,,,,,,
8087107,2012,2008/12172070,2008,1,1,1,1,1,"FLUIDMASTER, INC.",0,US,San Juan Capistrano,CA,Orange,E,2,2,2,0,fl:tu_ln:le-21,1,Tuan Le,fl:br_ln:janish-1,1,Bryan A. Janish,,,,,,,,,,,,,,,,,,,,,,0
8087108,2012,2007/11753738,2007,1,1,1,1,1,RUBBERMAID INCORPORATED,0,US,Huntersville,NC,Mecklenburg,A,4,4,3,1,fl:jo_ln:burns-6,1,Joy Burns,fl:sa_ln:rosenbach-1,0,Sarah Rosenbach,fl:ra_ln:lewis-24,1,Randall J. Lewis,fl:br_ln:cracchiola-2,1,Brad Cracchiola,,,,,,,,,,,,,,,,0
8087109,2012,2009/12581251,2009,1,0,0,1,1,,0,,,,,A,1,1,1,0,fl:wi_ln:hillenbrand-1,1,"William A. Hillenbrand, II",,,,,,,,,,,,,,,,,,,,,,,,,
8087110,2012,2011/13101342,2011,1,0,0,1,1,,0,,,,,A,3,2,1,1,fl:je_ln:park-43,0,Jee Sun Park,fl:my_ln:park-96,,Myung Soon Park,fl:be_ln:park-25,1,Beck Sun Park,,,,,,,,,,,,,,,,,,,
8087111,2012,2011/12986044,2011,1,0,0,1,1,,0,,,,,A,1,1,1,0,fl:ar_ln:paris-1,1,Armando Paris,,,,,,,,,,,,,,,,,,,,,,,,,
8087112,2012,2010/12686275,2010,1,0,0,1,1,,0,,,,,A,1,1,1,0,fl:di_ln:cahaan-1,1,Dirk Cahaan,,,,,,,,,,,,,,,,,,,,,,,,,
8087113,2012,2008/12211507,2008,1,1,1,1,1,HUNTLEIGH TECHNOLOGY LIMITED,0,GB,,,,A,2,2,2,0,fl:si_ln:roff-1,1,Simon Michael Roff,fl:ch_ln:rowe-4,1,Christopher Rowe,,,,,,,,,,,,,,,,,,,,,,0
8087114,2012,2005/11659326,2005,1,1,1,1,1,STJERNFJADRAR AB,0,SE,Herrljunga,,,A B F,1,1,1,0,fl:an_ln:lundevall-1,1,Andreas Lundevall,,,,,,,,,,,,,,,,,,,,,,,,,0
8087115,2012,2009/12429846,2009,1,1,1,1,1,"ELEMENTAL TOOLS, LLC",0,US,Richmond,VA,Richmond city,B,2,1,1,0,fl:la_ln:barber-1,,Launce R. Barber,fl:th_ln:stokes-5,1,Thomas Richard Stokes,,,,,,,,,,,,,,,,,,,,,,0
8087116,2012,2007/11985091,2007,1,1,1,1,1,HAYCO MANUFACTURING LIMITED,0,CN,Hong Kong,,,A,2,2,2,0,fl:gr_ln:spooner-4,1,Gregory Clegg Spooner,fl:ho_ln:vong-2,1,Hoss Vong,,,,,,,,,,,,,,,,,,,,,,0
8087117,2012,2007/11751413,2007,1,1,1,1,1,IROBOT CORPORATION,0,US,Bedford,MA,Middlesex,A,2,1,1,0,fl:de_ln:kapoor-2,1,Deepak Ramesh Kapoor,fl:zi_ln:dubrovsky-2,,Zivthan A. Dubrovsky,,,,,,,,,,,,,,,,,,,,,,0
8087118,2012,2008/12528991,2008,1,1,1,1,1,FUJIKURA LTD.,0,JP,Tokyo,,,B,1,0,0,0,fl:ku_ln:fujiwara-3,,Kunihiko Fujiwara,,,,,,,,,,,,,,,,,,,,,,,,,0
8087119,2012,2008/12327656,2008,1,1,1,1,1,SAUDI ARABIAN OIL COMPANY,0,SA,,,,B,1,1,1,0,fl:al_ln:mousa-1,1,Ali Ateyeh Mohammad Mousa,,,,,,,,,,,,,,,,,,,,,,,,,0
8087120,2012,2010/12824143,2010,1,0,0,1,1,,0,,,,,A,1,1,1,0,fl:be_ln:lochridge-1,1,Beau Alec Lochridge,,,,,,,,,,,,,,,,,,,,,,,,,
8087121,2012,2005/11280962,2005,1,1,1,1,1,"BUTLER HOME PRODUCTS, LLC",0,US,Marlborough,MA,Middlesex,A,3,3,3,0,fl:ro_ln:michelson-5,1,Robert Michelson,fl:ro_ln:cavalcanti-2,1,Robert Cavalcanti,fl:mi_ln:silverman-7,1,Michael Silverman,,,,,,,,,,,,,,,,,,,0
8087122,2012,2008/12215309,2008,1,0,0,1,1,,0,,,,,B,1,0,0,0,fl:ke_ln:martin-8,,Keith D. Martin,,,,,,,,,,,,,,,,,,,,,,,,,
8087123,2012,2010/12803954,2010,1,1,1,1,1,ALFRED KAERCHER GMBH & CO. KG,0,DE,Winnenden,,,A,1,1,1,0,fl:ju_ln:merz-3,1,Juergen Merz,,,,,,,,,,,,,,,,,,,,,,,,,0
8087124,2012,2007/11726325,2007,1,0,0,1,1,,0,,,,,A B,1,1,1,0,fl:me_ln:wolfe-2,1,"Melvin E. Wolfe, Jr.",,,,,,,,,,,,,,,,,,,,,,,,,
8087125,2012,2007/11961278,2007,1,1,1,1,1,"SHENZHEN FUTAIHONG PRECISION INDUSTRY CO., LTD.",0,CN,Riverview Drive,,,A,3,2,1,1,fl:sh_ln:wu-357,1,SHENG WU,fl:ji_ln:cui-73,,Jin Cui,fl:sa_ln:zhang-5,0,SAN-YAN ZHANG,,,,,,,,,,,,,,,,,,,0
8087126,2012,2008/12051198,2008,1,1,1,1,1,HILL-ROM S.A.S.,0,FR,Hennebont,,,B,3,3,3,0,fl:je_ln:duvert-1,1,Jean-Bernard Duvert,fl:pa_ln:guguin-1,1,Pascal Guguin,fl:fr_ln:ribera-1,1,Frédéric Ribera,,,,,,,,,,,,,,,,,,,0
8087127,2012,2006/12159209,2006,1,1,1,1,1,TENTE ROULETTES POLYMERES-BRUANDET,0,FR,Vitré,,,A B,1,1,1,0,fl:pa_ln:dayt-1,1,Patrick Dayt,,,,,,,,,,,,,,,,,,,,,,,,,0
8087128,2012,2009/12421721,2009,1,1,1,1,1,"HON HAI PRECISION INDUSTRY CO., LTD.",0,TW,Toucheng Township,,,E,5,4,4,0,fl:yu_ln:chou-77,1,Yu-Cheng Chou,fl:ji_ln:wang-490,1,JIN-XIN WANG,fl:ju_ln:duan-4,1,Jun Duan,fl:fa_ln:zhou-9,,Fan Zhou,fl:be_ln:long-1,1,Ben-Gui Long,,,,,,,,,,,,,1
8087129,2012,2007/12293007,2007,1,1,1,1,1,SECURISTYLE LIMITED,0,GB,Cheltenham,,,E,1,1,1,0,fl:jo_ln:lambert-26,1,John F. Lambert,,,,,,,,,,,,,,,,,,,,,,,,,0
8087130,2012,2008/12171702,2008,1,1,1,1,1,NIFCO (HK) LTD.,0,CN,Hong Kong,,,A,1,1,1,0,fl:ma_ln:chan-46,1,Man Chan,,,,,,,,,,,,,,,,,,,,,,,,,0
8087131,2012,2010/12806718,2010,1,0,0,1,1,,0,,,,,D,1,0,0,0,fl:yu_ln:cheng-98,,Yuan-Long Cheng,,,,,,,,,,,,,,,,,,,,,,,,,
8087132,2012,2011/13023069,2011,1,0,0,1,1,,0,,,,,A,2,2,1,1,fl:ge_ln:forrest-1,1,George G. Forrest,fl:ma_ln:rankin-1,0,Martha Elizabeth Rankin,,,,,,,,,,,,,,,,,,,,,,
8087133,2012,2010/12712865,2010,1,1,1,1,1,GROZ-BECKERT KG,0,DE,Albstadt,,,D,3,3,3,0,fl:fr_ln:jerger-1,1,Franz Jerger,fl:be_ln:munster-1,1,Bernhard Münster,fl:th_ln:maier-5,1,Thomas Maier,,,,,,,,,,,,,,,,,,,0
8087134,2012,2005/11793657,2005,1,1,1,1,1,NORSK HYDRO ASA,0,NO,Oslo,,,B,1,1,1,0,fl:ed_ln:morley-1,1,Ed Morley,,,,,,,,,,,,,,,,,,,,,,,,,0
8087135,2012,2010/12792167,2010,1,1,1,1,1,SEIKO INSTRUMENTS INC.,0,JP,Chiba,,,H,2,2,2,0,fl:ke_ln:ouchi-1,1,Keiichi Ouchi,fl:yu_ln:hoshi-11,1,Yuki Hoshi,,,,,,,,,,,,,,,,,,,,,,0
8087136,2012,2007/11905831,2007,1,1,1,1,1,TDK CORPORATION,0,JP,Tokyo,,,H,2,2,2,0,fl:ka_ln:ito-62,1,Kazushige Ito,fl:ak_ln:sato-25,1,Akira Sato,,,,,,,,,,,,,,,,,,,,,,0
8087137,2012,2009/12634701,2009,1,0,0,1,1,,0,,,,,B,1,0,0,0,fl:ti_ln:wang-68,,Tian Shoei Wang,,,,,,,,,,,,,,,,,,,,,,,,,
8087138,2012,2009/12322890,2009,1,0,0,1,1,,0,,,,,B,1,0,0,0,fl:ni_ln:gupta-42,,Nikhil Gupta,,,,,,,,,,,,,,,,,,,,,,,,,
8087139,2012,2009/12483461,2009,1,1,1,1,1,"HONDA MOTOR CO., LTD.",0,JP,Tokyo,,,B F,2,2,2,0,fl:ry_ln:tamamoto-1,1,Ryuhei Tamamoto,fl:hi_ln:moriyama-15,1,Hiroshi Moriyama,,,,,,,,,,,,,,,,,,,,,,0
8087140,2012,2009/12936525,2009,1,1,1,1,1,NITTO DENKO CORPORATION,0,JP,Osaka,,,B,4,3,3,0,fl:sa_ln:koshio-1,1,Satoru Koshio,fl:ka_ln:kitada-14,,Kazuo Kitada,fl:to_ln:yura-2,1,Tomokazu Yura,fl:ta_ln:nakazono-6,1,Takuya Nakazono,,,,,,,,,,,,,,,,0
8087141,2012,2007/11763266,2007,1,1,1,1,1,"ROCHE DIAGNOSTICS OPERATIONS, INC.",0,US,Indianapolis,IN,Marion,B,3,2,2,0,fl:pa_ln:griss-1,1,Patrick Griss,fl:ma_ln:zipfel-1,,Marzellinus Zipfel,fl:an_ln:lopez-30,1,Angel Lopez,,,,,,,,,,,,,,,,,,,0
8087142,2012,2008/12166329,2008,1,1,1,1,1,EASYLAP LTD.,0,IL,Kfar Truman,,,A B,2,2,2,0,fl:sh_ln:levin-4,1,Shalom Levin,fl:ni_ln:altman-1,1,Nir Altman,,,,,,,,,,,,,,,,,,,,,,0
8087143,2012,2008/12214345,2008,1,1,1,1,1,"EXOTHERMICS, INC.",0,US,Amherst,NH,Hillsborough,B F,1,1,1,0,fl:st_ln:dipietro-2,1,Stephen DiPietro,,,,,,,,,,,,,,,,,,,,,,,,,0
8087144,2012,2005/11072688,2005,1,0,0,1,1,,0,,,,,B,1,1,1,0,fl:do_ln:kain-1,1,Don Kain,,,,,,,,,,,,,,,,,,,,,,,,,
8087145,2012,2006/11377548,2006,1,1,1,1,1,THE BOEING COMPANY,0,US,Chicago,IL,Cook County,B,2,2,2,0,fl:br_ln:craig-14,1,Brent F. Craig,fl:er_ln:reid-1,1,Eric M. Reid,,,,,,,,,,,,,,,,,,,,,,0
8087146,2012,2008/11971992,2008,1,1,1,1,1,GM GLOBAL TECHNOLOGY OPERATIONS LLC,0,US,Detroit,MI,Wayne,B,1,1,1,0,fl:fr_ln:loscher-1,1,Frank LÖSCHER,,,,,,,,,,,,,,,,,,,,,,,,,0
8087147,2012,2010/12869359,2010,1,1,1,1,1,"PRAIRIE PACKAGING, INC.",0,US,Bedford Park,IL,Cook,B,2,2,2,0,fl:ro_ln:hollis-6,1,Robert W. Hollis,fl:di_ln:stamatiou-1,1,Dimitri Stamatiou,,,,,,,,,,,,,,,,,,,,,,0
8087148,2012,2006/11453037,2006,1,1,1,1,1,LG ELECTRONICS INC.,0,KR,Seoul,,,D,4,3,2,1,fl:ja_ln:kim-280,,Jae Kyum Kim,fl:ho_ln:kwon-38,1,Ho Cheol Kwon,fl:jo_ln:park-590,0,Jong A Park,fl:ka_ln:choi-30,1,Kang Mo Choi,,,,,,,,,,,,,,,,0
8087149,2012,2008/12248079,2008,1,1,1,1,1,GM GLOBAL TECHNOLOGY OPERATIONS LLC,0,US,Detroit,MI,Wayne,B F,2,1,1,0,fl:pe_ln:wang-54,,Pei-Chung Wang,fl:ro_ln:stevenson-18,1,Robin Stevenson,,,,,,,,,,,,,,,,,,,,,,0
8087150,2012,2007/12297943,2007,1,1,1,1,1,ESSILOR INTERNATIONAL (COMPAGNIE GENERALE D'OPTIQUE),0,FR,Charenton-le-Pont,,,B,2,2,2,0,fl:ce_ln:lemaire-1,1,Cedric Lemaire,fl:mi_ln:nauche-1,1,Michel Nauche,,,,,,,,,,,,,,,,,,,,,,0
8087151,2012,2007/12373908,2007,1,1,1,1,1,ELECTRONICS AND TELECOMMUNICATIONS RESEARCH INSTITUTE,0,KR,Daejeon,,,G,4,4,3,1,fl:ra_ln:park-12,0,Rae-Man Park,fl:sa_ln:kim-78,1,Sang Hyeob Kim,fl:jo_ln:park-355,1,Jonghyurk Park,fl:su_ln:maeng-8,1,Sunglyul Maeng,,,,,,,,,,,,,,,,0
8087152,2012,2009/12488590,2009,1,1,1,1,1,CANON KABUSHIKI KAISHA,0,JP,Tokyo,,,G,2,2,0,2,fl:ay_ln:kato-3,0,Ayako Kato,fl:ch_ln:chang-1265,0,Chienliu Chang,,,,,,,,,,,,,,,,,,,,,,0
8087153,2012,2009/12489315,2009,1,1,1,1,1,CANON KABUSHIKI KAISHA,0,JP,Tokyo,,,G,2,2,0,2,fl:ay_ln:kato-3,0,Ayako Kato,fl:ch_ln:chang-1265,0,Chienliu Chang,,,,,,,,,,,,,,,,,,,,,,0
8087154,2012,2007/11889763,2007,1,1,1,1,1,AISIN SEIKI KABUSHIKI KAISHA,0,JP,Miyoshi,,,H,3,2,2,0,fl:ak_ln:hoshino-5,,Akinori Hoshino,fl:ha_ln:suzuki-11,1,Haruji Suzuki,fl:sh_ln:kamio-2,1,Shusaku Kamio,,,,,,,,,,,,,,,,,,,0
8087155,2012,2009/12509333,2009,1,1,1,1,1,NHEW R&D PTY LTD,0,AU,Newcastle,,,H,1,1,1,0,fl:ne_ln:weste-1,1,Neil Weste,,,,,,,,,,,,,,,,,,,,,,,,,0
8087156,2012,2009/12632051,2009,1,1,1,1,1,LINDE AKTIENGESELLSCHAFT,0,JP,Kyoto,,,B G H,2,2,2,0,fl:ma_ln:gomyo-3,1,Masato Gomyo,fl:ta_ln:tamaoka-2,1,Takehito Tamaoka,,,,,,,,,,,,,,,,,,,,,,0
8087157,2012,2007/11975266,2007,1,1,1,1,1,"HEADWAY TECHNOLOGIES, INC.",0,US,Milpitas,CA,Santa Clara County,B G,6,5,3,2,fl:st_ln:kao-6,,Stuart Kao,fl:ch_ln:luo-51,0,Chunping Luo,fl:ch_ln:chen-1501,1,Chaopeng Chen,fl:ta_ln:machita-1,1,Takahiko Machita,fl:da_ln:miyauchi-2,1,Daisuke Miyauchi,fl:je_ln:chang-44,0,Jeiwei Chang,,,,,,,,,,0
8087158,2012,2008/12289579,2008,1,1,0,1,1,"CONTINENTAL AUTOMOTIVE SYSTEMS, INC.",0,,,,,H,1,1,1,0,fl:de_ln:spiers-2,1,Dean Leigh Spiers,,,,,,,,,,,,,,,,,,,,,,,,,0
8087159,2012,2007/12005214,2007,1,1,1,1,1,"KYOSHIN KOGYO CO., LTD.",0,JP,Osaka,,,B,1,1,1,0,fl:ke_ln:tokura-3,1,Kenji Tokura,,,,,,,,,,,,,,,,,,,,,,,,,0
8087160,2012,2007/11941111,2007,1,1,1,1,1,"CAPEWELL COMPONENTS COMPANY, LLC",0,US,Cromwell,CT,Middlesex,H,2,2,2,0,fl:an_ln:tarpill-1,1,Andrew J. Tarpill,fl:ta_ln:zagula-1,1,Tadeusz Zagula,,,,,,,,,,,,,,,,,,,,,,0
8087161,2012,2009/12400880,2009,1,1,1,1,1,"CHI MEI COMMUNICATION SYSTEMS, INC.",0,TW,Toucheng Township,,,B H,1,0,0,0,fl:ku_ln:ho-42,,Kun-Hung Ho,,,,,,,,,,,,,,,,,,,,,,,,,0
8087162,2012,2009/12569408,2009,1,1,1,1,1,ABBOTT DIABETES CARE INC.,0,US,Alameda,CA,Alameda,H,8,6,6,0,fl:be_ln:feldman-1,1,Benjamin J. Feldman,fl:ad_ln:heller-1,1,Adam Heller,fl:ep_ln:heller-1,1,Ephraim Heller,fl:fe_ln:mao-11,,Fei Mao,fl:jo_ln:vivolo-1,1,Joseph A. Vivolo,fl:je_ln:funderburk-1,1,Jeffery V. Funderburk,fl:fr_ln:colman-2,1,Fredric C. Colman,fl:ra_ln:krishnan-7,,Rajesh Krishnan,,,,0
8087163,2012,2006/12092806,2006,1,1,1,1,1,PAC TECH-PACKAGING TECHNOLOGIES GMBH,0,DE,Nauen,,,H,1,0,0,0,fl:gh_ln:azdasht-1,,Ghassem Azdasht,,,,,,,,,,,,,,,,,,,,,,,,,0
8087164,2012,2008/12120076,2008,1,1,1,1,1,"IBIDEN CO., LTD.",0,JP,Ogaki,,,H,2,2,2,0,fl:ka_ln:tanno-6,1,Katsuhiko Tanno,fl:yo_ln:kawamura-32,1,Youichirou Kawamura,,,,,,,,,,,,,,,,,,,,,,0
8087165,2012,2010/12713423,2010,1,1,1,1,1,"DELPHI TECHNOLOGIES, INC.",0,US,Troy,MI,Oakland,H,10,10,9,1,fl:ch_ln:snider-5,1,Chris R. Snider,fl:vi_ln:gupta-30,0,Vineet Gupta,fl:jo_ln:huntzinger-1,1,Joseph K. Huntzinger,fl:mi_ln:coady-1,1,Michael G. Coady,fl:cu_ln:stapert-1,1,Curtis Allen Stapert,fl:ke_ln:meyer-4,1,Kevin Earl Meyer,fl:ti_ln:garner-1,1,Timothy D. Garner,fl:je_ln:bell-5,1,Jeffrey T. Bell,fl:ro_ln:vadas-2,1,Robert L. Vadas,0
8087166,2012,2010/12760109,2010,1,1,1,1,1,COOPER TECHNOLOGIES COMPANY,0,US,Houston,TX,Harris County,H,2,2,2,0,fl:pa_ln:stoving-1,1,Paul N. Stoving,fl:e._ln:bestel-2,1,E. Fred Bestel,,,,,,,,,,,,,,,,,,,,,,0
8087167,2012,2005/11817889,2005,1,1,1,1,1,UNIVERSITäT AUGSBURG,0,DE,Augsburg,,,B,1,1,1,0,fl:pe_ln:kroner-1,1,Peter Kroner,,,,,,,,,,,,,,,,,,,,,,,,,0
8087168,2012,2009/12505510,2009,1,1,1,1,1,SILVERBROOK RESEARCH PTY LTD,0,AU,Forbes,,,B,6,6,5,1,fl:ki_ln:silverbrook-1,0,Kia Silverbrook,fl:da_ln:psaila-2,1,David Charles Psaila,fl:ga_ln:jackson-2,1,Garry Raymond Jackson,fl:ak_ln:nakazawa-8,1,Akira Nakazawa,fl:jo_ln:bulman-1,1,Jonathan Mark Bulman,fl:ja_ln:waszczuk-1,1,Jan Waszczuk,,,,,,,,,,0
8087169,2012,2004/11791790,2004,1,1,1,1,1,KABUSHIKI KAISHA TOSHIBA,0,JP,Akashi,,,B,3,3,3,0,fl:to_ln:kanemitsu-4,1,Toshiaki Kanemitsu,fl:ku_ln:harada-3,1,Kunihiro Harada,fl:na_ln:fujii-12,1,Naoki Fujii,,,,,,,,,,,,,,,,,,,0
8087170,2012,2006/11561213,2006,1,1,1,1,1,SEIKO EPSON CORPORATION,0,JP,Tokyo,,,A,6,6,6,0,fl:no_ln:sakurai-10,1,Noboru Sakurai,fl:yo_ln:yamada-49,1,Yoichi Yamada,fl:ju_ln:nakahara-1,1,Junichi Nakahara,fl:ma_ln:kunugi-4,1,Masanao Kunugi,fl:to_ln:aruga-6,1,Tomohiro Aruga,fl:ka_ln:okamoto-46,1,Katsumi Okamoto,,,,,,,,,,0
8087171,2012,2008/12220545,2008,1,1,1,1,1,"DANA AUTOMOTIVE SYSTEMS GROUP, LLC",0,US,Maumee,OH,Lucas,B,2,2,2,0,fl:er_ln:fischer-1,1,Eric M. Fischer,fl:jo_ln:smith-44,1,Johnny N. Smith,,,,,,,,,,,,,,,,,,,,,,0
8087172,2012,2008/12239030,2008,1,1,1,1,1,ALSTOM TECHNOLOGY LTD,0,CH,,,,B,2,2,2,0,fl:la_ln:farris-1,1,Lawrence S. Farris,fl:ma_ln:fuller-14,1,Mark A. Fuller,,,,,,,,,,,,,,,,,,,,,,0
8087173,2012,2008/12343573,2008,1,0,0,1,1,,0,,,,,B,2,2,2,0,fl:yu_ln:tang-16,1,Yu Kwong Savio Tang,fl:yu_ln:vinokurov-1,1,Yury Vinokurov,,,,,,,,,,,,,,,,,,,,,,
8087174,2012,2003/10338519,2003,1,1,1,1,1,OMNITEK PARTNERS LLC,0,US,Smithtown,NY,Suffolk,A,2,2,2,0,fl:th_ln:spinelli-2,1,Thomas Spinelli,fl:ja_ln:rastegar-1,1,Jahangir S. Rastegar,,,,,,,,,,,,,,,,,,,,,,0
8087175,2012,2009/12437156,2009,1,1,1,1,1,BRAUN GMBH,0,DE,Kronberg,,,B,5,5,4,1,fl:ma_ln:kluge-5,1,Martin Kluge,fl:an_ln:wurl-1,1,Andreas Wurl,fl:si_ln:stange-1,0,Silvia Stange,fl:pe_ln:stange-1,1,Pedro Stange,fl:an_ln:peter-7,1,Andreas Peter,,,,,,,,,,,,,0
8087176,2012,2010/12824716,2010,1,1,1,1,1,TRIMBLE NAVIGATION LIMITED,0,US,Sunnyvale,CA,Santa Clara,G,2,2,2,0,fl:ja_ln:hayes-14,1,James N. Hayes,fl:ch_ln:snyder-23,1,Chris Snyder,,,,,,,,,,,,,,,,,,,,,,0
8087177,2012,2010/12659049,2010,1,1,1,1,1,"STARBOARD INNOVATIONS, LLC",0,CA,Truro,NS,,B G,2,2,2,0,fl:ro_ln:chisholm-6,1,Ronald Chisholm,fl:pe_ln:alex-1,1,Peter Alex,,,,,,,,,,,,,,,,,,,,,,0
8087178,2012,2009/12642801,2009,1,0,0,1,1,,0,,,,,B,1,1,1,0,fl:ni_ln:panno-1,1,"Nicholas J. Panno, JR.",,,,,,,,,,,,,,,,,,,,,,,,,
8087179,2012,2010/12834814,2010,1,0,0,1,1,,0,,,,,G,1,1,1,0,fl:al_ln:gomez-29,1,Aldo Gomez,,,,,,,,,,,,,,,,,,,,,,,,,
8087180,2012,2010/12896865,2010,1,0,0,1,1,,0,,,,,G,1,1,1,0,fl:da_ln:clayton-6,1,David Clayton,,,,,,,,,,,,,,,,,,,,,,,,,
8087181,2012,2008/12140921,2008,1,1,1,1,1,VETCO GRAY INC.,0,US,Houston,TX,Harris County,G,2,1,1,0,fl:ro_ln:rogers-15,,Robert N. Rogers,fl:ri_ln:hunter-19,1,Rick C. Hunter,,,,,,,,,,,,,,,,,,,,,,0
8087182,2012,2008/12593639,2008,1,1,1,1,1,BSH BOSCH UND SIEMENS HAUSGERAETE GMBH,0,DE,Munich,,,F,1,1,1,0,fl:gu_ln:steffens-4,1,Günter Steffens,,,,,,,,,,,,,,,,,,,,,,,,,0
8087183,2012,2008/12222627,2008,1,1,1,1,1,MABE CANADA INC.,0,CA,Burlington,ON,,D F,2,2,1,1,fl:ga_ln:prajescu-1,1,Gabriel Prajescu,fl:do_ln:larochelle-1,0,Dominique Larochelle,,,,,,,,,,,,,,,,,,,,,,0
8087184,2012,2006/11495796,2006,1,1,1,1,1,GENERAL ELECTRIC COMPANY,0,US,Schenectady,NY,Schenectady County,F,7,7,5,2,fl:ma_ln:banta-2,1,Mark A. Banta,fl:ra_ln:calmeise-1,1,Randall W. Calmeise,fl:mi_ln:beyerle-1,1,Michael Thomas Beyerle,fl:ja_ln:king-61,0,Jason King,fl:re_ln:eakins-1,0,Rebecca Eakins,fl:de_ln:watkins-6,1,Derek Lee Watkins,fl:er_ln:watson-4,1,Eric K. Watson,,,,,,,0
8087185,2012,2008/12222628,2008,1,1,1,1,1,MABE CANADA INC.,0,CA,Burlington,ON,,F,1,1,1,0,fl:ma_ln:leclerc-11,1,Martin Leclerc,,,,,,,,,,,,,,,,,,,,,,,,,0
8087186,2012,2008/12075645,2008,1,1,1,1,1,OMNITEK PARTNERS LLC,0,US,Smithtown,NY,Suffolk,A,2,1,1,0,fl:ja_ln:rastegar-1,1,Jahangir S. Rastegar,fl:tr_ln:spinelli-1,,Tromas Spinelli,,,,,,,,,,,,,,,,,,,,,,0
8087187,2012,2008/12265878,2008,1,1,1,1,1,"NIKE, INC.",0,US,Beaverton,OR,Washington,A,3,3,2,1,fl:mi_ln:aveni-1,1,Michael A. Aveni,fl:th_ln:mcguirk-1,1,Thomas McGuirk,fl:da_ln:taylor-3,0,Danielle L. Taylor,,,,,,,,,,,,,,,,,,,0
8087188,2012,2007/11872695,2007,1,0,0,1,1,,0,,,,,A,1,1,1,0,fl:fr_ln:labbe-2,1,Frederick Labbe,,,,,,,,,,,,,,,,,,,,,,,,,
8087189,2012,2010/12961265,2010,1,1,1,1,1,CALLAWAY GOLF COMPANY,0,US,Carlsbad,CA,San Diego,A C,3,3,3,0,fl:jo_ln:bobbett-1,1,Jon Bobbett,fl:mi_ln:roy-10,1,Michael Roy,fl:ja_ln:gorman-8,1,James Gorman,,,,,,,,,,,,,,,,,,,0
8087190,2012,2009/12646016,2009,1,0,0,1,1,,0,,,,,G,1,1,0,1,30ocpymapabtq2mhulht1qcb8,0,J. Rebecca Rivera-Andrianakos,,,,,,,,,,,,,,,,,,,,,,,,,
8087191,2012,2009/12426992,2009,1,1,1,1,1,ADVANCED DISPLAY TECHNOLOGY AG,0,CH,Appenzell,,,A B E F G,3,3,3,0,fl:fr_ln:bartels-7,1,Frank Bartels,fl:an_ln:bitman-1,1,Andriy Bitman,fl:di_ln:jerosch-1,1,Dieter Jerosch,,,,,,,,,,,,,,,,,,,0
8087192,2012,2008/12166850,2008,1,1,1,1,1,YOUNG ELECTRIC SIGN COMPANY,0,US,Salt Lake City,UT,Salt Lake,G,3,2,2,0,fl:mi_ln:allen-26,1,Miles Allen,fl:da_ln:beza-1,,Dan Beza,fl:ri_ln:juleen-1,1,"Rick Juleen, Jr.",,,,,,,,,,,,,,,,,,,0
8087193,2012,2009/12411610,2009,1,1,1,1,1,"ABRAMS AIRBORNE MANUFACTURING, INC.",0,US,Tucson,AZ,Pima,F,1,1,1,0,fl:er_ln:kincel-1,1,Eric Stephen Kincel,,,,,,,,,,,,,,,,,,,,,,,,,0
8087194,2012,2009/12409783,2009,1,1,1,1,1,"STURM, RUGER & COMPANY, INC.",0,US,Southport,CT,Fairfield,F,1,1,1,0,fl:br_ln:vuksanovich-1,1,Brian Vuksanovich,,,,,,,,,,,,,,,,,,,,,,,,,0
8087195,2012,2009/12478961,2009,1,1,1,1,1,"DUFFY'S HUNTING PRODUCTS, INC.",0,US,Canandaigua,NY,Canandaigua Town,A F G,1,1,1,0,fl:ja_ln:minges-1,1,James C. Minges,,,,,,,,,,,,,,,,,,,,,,,,,0
8087196,2012,2008/12667576,2008,1,1,1,1,1,IN JUNG,1,KR,Seojong-myeon,,,F,2,1,1,0,fl:in_ln:jung-34,,In-Soo Jung,fl:do_ln:lee-117,1,Dong Hee Lee,,,,,,,,,,,,,,,,,,,,,,0
8087197,2012,2007/11966013,2007,1,1,1,1,1,RAYTHEON COMPANY,0,US,Waltham,MA,Middlesex,F,2,2,2,0,fl:wi_ln:stenton-1,1,William Conrad Stenton,fl:st_ln:szapiel-1,1,Stanislaw Szapiel,,,,,,,,,,,,,,,,,,,,,,0
8087198,2012,2009/12436867,2009,1,1,1,1,1,"ASIA OPTICAL CO., INC.",0,TW,Zhuolan Township,,,F,2,1,1,0,fl:ts_ln:tsai-59,1,Tsung-Mou Tsai,fl:yu_ln:lin-214,,Yu-Sheng Lin,,,,,,,,,,,,,,,,,,,,,,0
8087199,2012,2009/12550720,2009,1,0,0,1,1,,0,,,,,A,1,1,1,0,fl:ga_ln:roe-1,1,Garrett W. Roe,,,,,,,,,,,,,,,,,,,,,,,,,
8087200,2012,2010/12802939,2010,1,0,0,1,1,,0,,,,,A,1,1,1,0,z9j85ed0e6s5ndw19cgtq7uar,1,Jimmy A. Ferriss,,,,,,,,,,,,,,,,,,,,,,,,,
8087201,2012,2009/12471068,2009,1,1,1,1,1,"VALMONT INDUSTRIES, INC.",0,US,Omaha,NE,Douglas,A,2,1,1,0,fl:ja_ln:larue-1,1,Jacob L. LaRue,fl:ge_ln:concenco-1,,Germani Concenco,,,,,,,,,,,,,,,,,,,,,,0
8087202,2012,2009/12584455,2009,1,0,0,1,1,,0,,,,,E,1,1,1,0,fl:jo_ln:ciavolella-1,1,John Ciavolella,,,,,,,,,,,,,,,,,,,,,,,,,
8087203,2012,2009/12565003,2009,1,1,1,1,1,"PDC FACILITIES, INC.",0,US,Hartland,WI,Waukesha,E,4,4,4,0,fl:ma_ln:boesel-2,1,Matthew Boesel,fl:ja_ln:maslowski-1,1,James P. Maslowski,fl:de_ln:molstad-1,1,Dean Molstad,fl:st_ln:zwicke-1,1,Steve Zwicke,,,,,,,,,,,,,,,,0
8087204,2012,2008/12169298,2008,1,0,0,1,1,,0,,,,,E,1,1,1,0,fl:fe_ln:sorkin-1,1,Felix L. Sorkin,,,,,,,,,,,,,,,,,,,,,,,,,
8087205,2012,2008/12196115,2008,1,1,1,1,1,CALIFORNIA EXPANDED METAL PRODUCTS COMPANY,0,US,Poway,CA,San Diego,E,3,3,3,0,fl:do_ln:pilz-2,1,Don A. Pilz,fl:ra_ln:poliquin-1,1,Raymond E. Poliquin,fl:fe_ln:sesma-1,1,Fernando Hernandez Sesma,,,,,,,,,,,,,,,,,,,0
8087206,2012,2009/12577135,2009,1,0,0,1,1,,0,,,,,E,2,2,2,0,fl:ro_ln:worley-1,1,Ronald J. Worley,fl:ha_ln:robinson-2,1,Harry Robinson,,,,,,,,,,,,,,,,,,,,,,
8087207,2012,2005/11201861,2005,1,0,0,1,1,,0,,,,,E,1,1,1,0,fl:jo_ln:ghiringhelli-1,1,Joseph James Ghiringhelli,,,,,,,,,,,,,,,,,,,,,,,,,
8087208,2012,2008/12241772,2008,1,0,0,1,1,,0,,,,,E,3,3,3,0,fl:ma_ln:quintile-1,1,Mark J. Quintile,fl:mi_ln:bittner-5,1,Michael L. Bittner,fl:da_ln:maynard-8,1,Dale Maynard,,,,,,,,,,,,,,,,,,,
8087209,2012,2010/12693349,2010,1,1,1,1,1,KUEBERIT PROFILE SYSTEMS GMBH & CO. KG,0,DE,Breitscheid,,,E,1,1,1,0,fl:da_ln:sondermann-1,1,David Sondermann,,,,,,,,,,,,,,,,,,,,,,,,,0
8087210,2012,2006/11631510,2006,1,1,1,1,1,TEC. INN S.R.L.,0,IT,Fabriano,,,E,1,1,1,0,fl:em_ln:agneloni-1,1,Emo Agneloni,,,,,,,,,,,,,,,,,,,,,,,,,0
8087211,2012,2004/10593236,2004,1,1,1,1,1,"SUEHIRO-SYSTEM CO., LTD.",0,JP,Osaka,,,E,2,2,2,0,fl:mo_ln:suehiro-2,1,Morio Suehiro,fl:hi_ln:suehiro-7,1,Hirokazu Suehiro,,,,,,,,,,,,,,,,,,,,,,0
8087212,2012,2011/13004219,2011,1,1,1,1,1,MASONITE CORPORATION,0,US,Tampa,FL,Hillsborough County,E,2,1,1,0,fl:ge_ln:hardwick-1,1,Geoffrey B. Hardwick,fl:ra_ln:mcguire-3,,Randy C. McGuire,,,,,,,,,,,,,,,,,,,,,,0
8087213,2012,2008/12258839,2008,1,1,1,1,1,SCHLAGE LOCK COMPANY LLC,0,US,Carmel,IN,Hamilton,B,7,6,5,1,fl:ya_ln:dhuru-1,,Yashodhan Dhuru,fl:sc_ln:niedzwecki-1,1,Scott Niedzwecki,fl:sc_ln:liu-2,1,Scott Liu,fl:mi_ln:holman-1,1,Michael Holman,fl:br_ln:schaffer-3,1,Bruce Schaffer,fl:sh_ln:bieker-1,0,Shell Bieker,fl:ro_ln:hickman-5,1,Robert J. Hickman,,,,,,,0
8087214,2012,2007/11893252,2007,1,1,0,1,1,2004ADPLOY LIMITED PARTNERSHIP,0,,,,,B,2,1,1,0,fl:ma_ln:thuesen-3,1,Marcus L. Thuesen,fl:le_ln:brana-1,,Lejo C. Brana,,,,,,,,,,,,,,,,,,,,,,0
8087215,2012,2007/12227173,2007,1,1,1,1,1,WINDMOLLER & HOLSCHER,0,DE,Lengerich,,,B,4,4,4,0,fl:ma_ln:koelker-1,1,Martin Koelker,fl:lu_ln:schulten-1,1,Ludger Schulten,fl:th_ln:knoke-1,1,Thomas Knoke,fl:ul_ln:stienecker-1,1,Ulrich Stienecker,,,,,,,,,,,,,,,,0
8087216,2012,2010/12712484,2010,1,1,1,1,1,DEERE & COMPANY,0,US,Moline,IL,Rock Island,B,6,6,5,1,fl:ja_ln:noonan-3,1,James T. Noonan,fl:do_ln:goodrich-4,0,Donald Lee Goodrich,fl:je_ln:haecker-1,1,Jesse D. Haecker,fl:je_ln:hall-5,1,Jerry B. Hall,fl:ma_ln:cracraft-1,1,Mark A. Cracraft,fl:ea_ln:canfield-1,1,Earl Franklin Canfield,,,,,,,,,,0