patent_number,grant_year,application_number,application_year,d_inventor,d_assignee,d_location,d_application,d_ipc,assignee,assignee_ind,country,city,state,county,ipc_section,team_size,inventors,men_inventors,women_inventors,inventor_id1,male_flag1,inventor_name1,inventor_id2,male_flag2,inventor_name2,inventor_id3,male_flag3,inventor_name3,inventor_id4,male_flag4,inventor_name4,inventor_id5,male_flag5,inventor_name5,inventor_id6,male_flag6,inventor_name6,inventor_id7,male_flag7,inventor_name7,inventor_id8,male_flag8,inventor_name8,inventor_id9,male_flag9,inventor_name9,assignee_sequence
10524402,2020,2017/15665025,2017,1,1,1,1,1,"BLUE COAT SYSTEMS, INC.",0,US,Sunnyvale,CA,Santa Clara,A G,1,1,1,0,fl:le_ln:redden-1,1,Lee Kamp Redden,,,,,,,,,,,,,,,,,,,,,,,,,0
10524403,2020,2017/15794349,2017,1,1,1,1,1,DEERE & COMPANY,0,US,Moline,IL,Rock Island,A G,3,3,3,0,fl:va_ln:gresch-1,1,Valentin Gresch,fl:ma_ln:kremmer-1,1,Martin Kremmer,fl:ra_ln:isele-1,1,Ramon Isele,,,,,,,,,,,,,,,,,,,0
10524404,2020,2017/15487306,2017,1,1,1,1,1,"FEHR'S INDUSTRIAL MANUFACTURING, LLC",0,US,Seminole,TX,Gaines,A,1,0,0,0,fl:jo_ln:fehr-2,,John Fehr,,,,,,,,,,,,,,,,,,,,,,,,,0
10524405,2020,2017/15598081,2017,1,1,1,1,1,CNH INDUSTRIAL AMERICA LLC,0,US,New Holland,PA,Lancaster,A F,5,4,4,0,fl:ry_ln:raetzman-1,1,Ryan R. Raetzman,fl:ma_ln:prickel-1,1,Marvin A. Prickel,fl:br_ln:anderson-45,,Brian J. Anderson,fl:tr_ln:harnetiaux-1,1,Travis L. Harnetiaux,fl:jo_ln:dienst-1,1,Johnathon R. Dienst,,,,,,,,,,,,,0
10524406,2020,2016/15299629,2016,1,1,1,1,1,KUHN S.A.,0,FR,Saverne,,,A B G,3,3,3,0,fl:ph_ln:potier-1,1,Philippe Potier,fl:an_ln:yatskul-1,1,Andrii Yatskul,fl:je_ln:lemiere-1,1,Jean-Pierre Lemiere,,,,,,,,,,,,,,,,,,,0
10524407,2020,2017/15639794,2017,1,1,1,1,1,DEERE & COMPANY,0,US,Moline,IL,Rock Island,A B,3,3,3,0,fl:ty_ln:schleicher-1,1,Tyler D. Schleicher,fl:da_ln:mulder-2,1,David L. Mulder,fl:no_ln:rasmussen-2,1,Noah J. Rasmussen,,,,,,,,,,,,,,,,,,,0
10524408,2020,2018/16034186,2018,1,1,1,1,1,"CNH INDUSTRIAL CANADA, LTD.",0,CA,Saskatoon,SK,,A B,7,7,7,0,fl:de_ln:chahley-1,1,Dennis W. Chahley,fl:go_ln:engel-2,1,Gordon Anthony Engel,fl:ja_ln:turner-36,1,Jack Donald Turner,fl:de_ln:thompson-12,1,Dennis George Thompson,fl:gr_ln:erker-2,1,Gregory Jacob Erker,fl:tr_ln:kowalchuk-1,1,Trevor Lawrence Kowalchuk,fl:an_ln:rapley-1,1,Anthony Charles Rapley,,,,,,,0
10524409,2020,2017/15583684,2017,1,1,1,1,1,"AUTONOMOUS SOLUTIONS, INC.",0,US,Mendon,UT,Cache,A,4,4,4,0,fl:jo_ln:posselius-1,1,John H. Posselius,fl:lu_ln:ferrari-1,1,Luca Ferrari,fl:ta_ln:bybee-1,1,Taylor C. Bybee,fl:br_ln:turpin-1,1,Bret Todd Turpin,,,,,,,,,,,,,,,,1
10524410,2020,2017/15678215,2017,1,1,1,1,1,CNH INDUSTRIAL AMERICA LLC,0,US,New Holland,PA,Lancaster,A,2,2,2,0,fl:ch_ln:schoeny-1,1,Christopher Schoeny,fl:ch_ln:johnson-126,1,Chad M. Johnson,,,,,,,,,,,,,,,,,,,,,,0
10524411,2020,2018/15870097,2018,1,1,1,1,1,JIANGSU UNIVERSITY,0,CN,安丰镇,,,A,3,0,0,0,fl:li_ln:dong-38,,Lili Dong,fl:lv_ln:han-1,,Lvhua HAN,fl:zh_ln:wang-367,,Zhen-Hua Wang,,,,,,,,,,,,,,,,,,,0
10524412,2020,2014/14256986,2014,1,0,0,1,1,,0,,,,,A,1,1,1,0,fl:ro_ln:harvey-15,1,"Robert E. Harvey, III",,,,,,,,,,,,,,,,,,,,,,,,,
10524413,2020,2016/15551877,2016,1,0,0,1,1,,0,,,,,A,1,0,0,0,fl:on_ln:favoretto-1,,Onivaldo Favoretto,,,,,,,,,,,,,,,,,,,,,,,,,
10524414,2020,2017/15701117,2017,1,1,1,1,1,"HRM ENTERPRISES, INC.",0,US,Westerly,RI,Washington County,A,1,1,1,0,fl:ri_ln:zerbarini-1,1,Richard Zerbarini,,,,,,,,,,,,,,,,,,,,,,,,,0
10524415,2020,2017/15728899,2017,1,1,1,1,1,CNH INDUSTRIAL AMERICA LLC,0,US,New Holland,PA,Lancaster,A,1,1,1,0,fl:bl_ln:noll-1,1,Blaine R. Noll,,,,,,,,,,,,,,,,,,,,,,,,,0
10524416,2020,2017/15825487,2017,1,1,1,1,1,KUBOTA CORPORATION,0,JP,Osaka,,,A G,2,1,1,0,fl:ka_ln:kawamoto-21,1,Kazuyoshi Kawamoto,fl:sh_ln:fujii-51,,Shunsuke Fujii,,,,,,,,,,,,,,,,,,,,,,0
10524417,2020,2019/16371267,2019,1,1,1,1,1,"NANJING CHERVON INDUSTRY CO., LTD.",0,CN,Nanjing,,,A,2,0,0,0,fl:go_ln:fan-2,,Gongyuan Fan,fl:zh_ln:wang-372,,Zhen Wang,,,,,,,,,,,,,,,,,,,,,,0
10524418,2020,2016/15004097,2016,1,1,1,1,1,"EXCEL INDUSTRIES, INC.",0,US,Hesston,KS,Harvey,A,1,1,1,0,fl:ja_ln:wright-22,1,James A. Wright,,,,,,,,,,,,,,,,,,,,,,,,,0
10524419,2020,2017/15605715,2017,1,1,1,1,1,"ACCELERATOR INDUSTRIES, INC.",0,US,Kent,WA,King,A,2,2,2,0,fl:pe_ln:andonian-1,1,Peter Andonian,fl:da_ln:hackett-2,1,David J. Hackett,,,,,,,,,,,,,,,,,,,,,,0
10524420,2020,2016/15238276,2016,1,1,1,1,1,CHERVON (HK) LIMITED,0,CN,Hong Kong,,,A,4,1,1,0,fl:to_ln:yamaoka-1,1,Toshinari Yamaoka,fl:fa_ln:nie-1,,Fangjie Nie,fl:ha_ln:xu-17,,Haishen Xu,fl:xi_ln:shao-16,,Xiandian Shao,,,,,,,,,,,,,,,,0
10524421,2020,2017/15718946,2017,1,1,1,1,1,DEERE & COMPANY,0,US,Moline,IL,Rock Island,A G,3,2,2,0,fl:gu_ln:advani-2,,Gurmukh H. Advani,fl:ry_ln:king-5,1,Ryan King,fl:no_ln:anderson-5,1,Noel W. Anderson,,,,,,,,,,,,,,,,,,,0
10524422,2020,2017/15499939,2017,1,1,1,1,1,DEERE & COMPANY,0,US,Moline,IL,Rock Island,A,2,2,2,0,fl:al_ln:brimeyer-1,1,Alex Brimeyer,fl:mi_ln:vandeven-3,1,Michael L. Vandeven,,,,,,,,,,,,,,,,,,,,,,0
10524423,2020,2019/16279445,2019,1,1,1,1,1,"HEMP PROCESSING SOLUTIONS, LLC",0,US,Harrisburg,SD,Lincoln,A,3,2,2,0,fl:ro_ln:olson-47,1,Roy Olson,fl:jo_ln:tracy-12,1,Joshua Tracy,fl:al_ln:pearson-12,,Alex Pearson,,,,,,,,,,,,,,,,,,,0
10524424,2020,2017/15569817,2017,1,0,0,1,1,,0,,,,,A,1,1,0,1,fl:ky_ln:seo-12,0,Kyoung-Jin Seo,,,,,,,,,,,,,,,,,,,,,,,,,
10524425,2020,2019/16456401,2019,1,1,1,1,1,"IRON OX, INC.",0,US,San Francisco,CA,San Francisco,A B G,2,2,2,0,fl:br_ln:alexander-1,1,Brandon Ace Alexander,fl:jo_ln:binney-2,1,Jonathan Binney,,,,,,,,,,,,,,,,,,,,,,0
10524426,2020,2018/16018512,2018,1,1,1,1,1,SIGNIFY HOLDING B.V.,0,NL,Eindhoven,,,A H,1,1,1,0,fl:zd_ln:grajcar-1,1,Zdenko Grajcar,,,,,,,,,,,,,,,,,,,,,,,,,0
10524427,2020,2014/14229615,2014,1,1,1,1,1,"KLONDIKE AGRICULTURAL PRODUCTS, LLC",0,US,Tampa,FL,Hillsborough County,A,1,1,1,0,fl:da_ln:cox-38,1,Daniel S. Cox,,,,,,,,,,,,,,,,,,,,,,,,,0
10524428,2020,2014/14767433,2014,1,1,1,1,1,"RN HOLDINGS, LLC",0,US,Joplin,MO,Jasper County,A,1,1,1,0,fl:na_ln:davenport-3,1,Natalie Lorene Davenport,,,,,,,,,,,,,,,,,,,,,,,,,0
10524429,2020,2017/15731667,2017,1,1,1,1,1,"TREBRO HOLDING, INC.",0,US,Billings,MT,Yellowstone,A B,1,1,1,0,fl:gr_ln:tvetene-1,1,Gregg Tvetene,,,,,,,,,,,,,,,,,,,,,,,,,0
10524430,2020,2018/16043891,2018,1,0,0,1,1,,0,,,,,A G,2,2,2,0,fl:bl_ln:nervino-1,1,Blake Nervino,fl:wi_ln:espinoza-1,1,William Espinoza,,,,,,,,,,,,,,,,,,,,,,
10524431,2020,2014/14334809,2014,1,0,0,1,1,,0,,,,,A,1,1,1,0,fl:br_ln:vandevrede-1,1,Bryan Vande Vrede,,,,,,,,,,,,,,,,,,,,,,,,,
10524432,2020,2016/15008138,2016,1,1,1,1,1,GREENONYX LTD,0,IL,Nes Ziona,,,A B C G,2,1,1,0,fl:ts_ln:shoham-1,,Tsipi Shoham,fl:be_ln:shoham-2,1,Benjamin Shoham,,,,,,,,,,,,,,,,,,,,,,0
10524433,2020,2017/15589845,2017,1,0,0,1,1,,0,,,,,A,1,1,1,0,fl:da_ln:spiro-1,1,Daniel S. Spiro,,,,,,,,,,,,,,,,,,,,,,,,,
10524434,2020,2018/16028218,2018,1,1,1,1,1,ACENTURE GLOBAL SERVICES LIMITED,0,IE,Dublin,,,A,3,3,3,0,fl:eu_ln:vanbuuren-1,1,Eugene Van Buuren,fl:ja_ln:vanbuuren-1,1,Jacques Van Buuren,fl:ja_ln:ehlers-3,1,Jan Gerhardus Ehlers,,,,,,,,,,,,,,,,,,,0
10524435,2020,2018/15995219,2018,1,1,1,1,1,"AGRIGENETICS, INC.",0,US,Indianapolis,IN,Marion,A,1,1,1,0,fl:ar_ln:ahmadzadeh-1,1,Ardeshir Ahmadzadeh,,,,,,,,,,,,,,,,,,,,,,,,,0
10524436,2020,2010/13504156,2010,1,1,1,1,1,AGVENTURE B.V.,0,NL,Diepenveen,,,A,5,5,5,0,fl:wi_ln:lindhout-1,1,Willem Hendrik Lindhout,fl:te_ln:schotte-1,1,Teunis Philippus Schotte,fl:ri_ln:visser-1,1,Richard Gerardus Franciscus Visser,fl:he_ln:vaneck-1,1,Herman Johannes van Eck,fl:ro_ln:hutten-1,1,Ronaldus Cornelis Bernardus Hutten,,,,,,,,,,,,,0
10524437,2020,2018/16119966,2018,1,1,1,1,1,"SEMINIS VEGETABLE SEEDS, INC.",0,US,Woodland,CA,Yolo,A,1,1,1,0,fl:be_ln:vandenbosch-1,1,Bernardus van den Bosch,,,,,,,,,,,,,,,,,,,,,,,,,0
10524438,2020,2018/15924566,2018,1,1,1,1,1,"PIONEER HI-BRED INTERNATIONAL, INC.",0,US,Marshalltown,IA,Marshall,A,2,2,2,0,fl:go_ln:drinic-1,1,Goran Drinic,fl:mi_ln:rosulj-1,1,Milorad Rosulj,,,,,,,,,,,,,,,,,,,,,,0
10524439,2020,2018/15995217,2018,1,1,1,1,1,"AGRIGENETICS, INC.",0,US,Indianapolis,IN,Marion,A,1,1,1,0,fl:je_ln:rice-2,1,Jerry R. Rice,,,,,,,,,,,,,,,,,,,,,,,,,0
10524440,2020,2018/15995236,2018,1,1,1,1,1,"AGRIGENETICS, INC.",0,US,Indianapolis,IN,Marion,A C,1,1,1,0,fl:st_ln:plehn-1,1,Steve J. Plehn,,,,,,,,,,,,,,,,,,,,,,,,,0
10524441,2020,2018/15995238,2018,1,1,1,1,1,"AGRIGENETICS, INC.",0,US,Indianapolis,IN,Marion,A C,1,1,1,0,fl:ry_ln:thorson-1,1,Ryan Thorson,,,,,,,,,,,,,,,,,,,,,,,,,0
10524442,2020,2018/15995318,2018,1,1,1,1,1,"AGRIGENETICS, INC.",0,US,Indianapolis,IN,Marion,A C,1,1,1,0,fl:st_ln:plehn-1,1,Steve J. Plehn,,,,,,,,,,,,,,,,,,,,,,,,,0
10524443,2020,2018/16023763,2018,1,1,1,1,1,"AGRIGENETICS, INC.",0,US,Indianapolis,IN,Marion,A,1,1,1,0,fl:ch_ln:flachenecker-1,1,Christian Flachenecker,,,,,,,,,,,,,,,,,,,,,,,,,0
10524444,2020,2018/15979630,2018,1,1,1,1,1,"PIONEER HI-BRED INTERNATIONAL, INC.",0,US,Marshalltown,IA,Marshall,A,1,1,1,0,fl:do_ln:glover-1,1,Donnie G Glover,,,,,,,,,,,,,,,,,,,,,,,,,0
10524445,2020,2018/16053645,2018,1,1,1,1,1,"M.S. TECHNOLOGIES, L.L.C.",0,US,West Point,IA,Lee,A,1,1,1,0,fl:ju_ln:mason-1,1,Justin T. Mason,,,,,,,,,,,,,,,,,,,,,,,,,0
10524446,2020,2018/16111016,2018,1,1,1,1,1,MONSANTO COMPANY,0,US,Chesterfield,MO,St. Louis,A,1,1,1,0,fl:th_ln:jury-2,1,Thomas P. Jury,,,,,,,,,,,,,,,,,,,,,,,,,0
10524447,2020,2017/15731566,2017,1,1,1,1,1,RONALD MARK TAYEBI,1,US,Chelmsford,MA,Middlesex,A B,1,1,1,0,d2ya4uqrwnshdox0jkmur58o2,1,Ronald Mark Tayebi,,,,,,,,,,,,,,,,,,,,,,,,,0
10524448,2020,2016/15362990,2016,1,0,0,1,1,,0,,,,,A E,1,1,1,0,fl:ga_ln:hager-4,1,Garry R. Hager,,,,,,,,,,,,,,,,,,,,,,,,,
10524449,2020,2018/15896883,2018,1,1,1,1,1,HAVWIN LLC,0,US,Bern,KS,Nemaha,A,1,1,1,0,fl:le_ln:winkler-1,1,LeRoy E. Winkler,,,,,,,,,,,,,,,,,,,,,,,,,0
10524450,2020,2017/15684053,2017,1,1,1,1,1,HIMALAYAN CORPORATION,0,US,Mukilteo,WA,Snohomish,A,1,1,1,0,fl:al_ln:dewey-1,1,Alan J. Dewey,,,,,,,,,,,,,,,,,,,,,,,,,0
10524451,2020,2018/16179172,2018,1,1,1,1,1,SALVATORE SCIORTINO,1,US,Levittown,NY,Nassau,A,4,4,3,1,fl:sa_ln:sciortino-1,1,Salvatore Sciortino,fl:an_ln:martin-29,0,Andrew Martin,fl:ch_ln:montalbano-1,1,Christopher Montalbano,fl:gr_ln:montalbano-2,1,Gregory Montalbano,,,,,,,,,,,,,,,,0
10524452,2020,2017/15731694,2017,1,0,0,1,1,,0,,,,,A,1,1,1,0,fl:aa_ln:feldman-2,1,Aaron Feldman,,,,,,,,,,,,,,,,,,,,,,,,,
10524453,2020,2018/15906412,2018,1,1,1,1,1,SONY CORPORATION,0,US,Golden,CO,Jefferson,A,1,1,1,0,fl:jo_ln:stone-4,1,John James Stone,,,,,,,,,,,,,,,,,,,,,,,,,0
10524454,2020,2019/16279136,2019,1,1,1,1,1,"IFETCH, LLC",0,US,Austin,TX,Travis County,A,6,6,3,3,fl:de_ln:hamill-3,1,Dennis W. Hamill,fl:de_ln:hamill-1,0,Deborah Lynn Hamill,fl:le_ln:hamill-1,1,Lee Elizabeth Hamill,fl:gr_ln:hamill-1,1,Grant Patrick Hamill,fl:ka_ln:hamill-1,0,Katie Marcella Hamill,fl:lu_ln:hamill-1,0,Lucy Rejahl Hamill,,,,,,,,,,0
10524455,2020,2019/16279432,2019,1,1,1,1,1,THE UNIVERSITY OF NORTH CAROLINA AT GREENSBORO,0,US,Greensboro,NC,Guilford,A,2,2,1,1,fl:ka_ln:wagoner-1,0,Kaira Wagoner,fl:ol_ln:rueppell-1,1,Olav Rueppell,,,,,,,,,,,,,,,,,,,,,,0
10524456,2020,2015/15313985,2015,1,1,1,1,1,"ROLF C. HAGEN, INC.",0,CA,Montréal,QC,,A,2,2,2,0,fl:va_ln:bresolin-1,1,Valerio Bresolin,fl:ro_ln:reid-20,1,Robert Reid,,,,,,,,,,,,,,,,,,,,,,0
10524457,2020,2018/15926840,2018,1,0,0,1,1,,0,,,,,A,1,1,1,0,fl:tr_ln:power-3,1,Travis Jack Power,,,,,,,,,,,,,,,,,,,,,,,,,
10524458,2020,2018/16025377,2018,1,1,1,1,1,"REGENERON PHARMACEUTICALS, INC.",0,US,Tarrytown,NY,Westchester,A C,6,5,3,2,fl:yi_ln:hu-62,,Ying Hu,fl:ad_ln:latuszek-1,0,Adrianna Latuszek,fl:ji_ln:cao-12,1,Jingtai Cao,fl:al_ln:mujica-1,1,Alexander O. Mujica,fl:st_ln:wiegand-1,1,Stanley Wiegand,fl:an_ln:murphy-2,0,Andrew J. Murphy,,,,,,,,,,0
10524459,2020,2014/14154646,2014,1,0,0,1,1,,0,,,,,A,1,1,0,1,fl:st_ln:parks-11,0,Steve Parks,,,,,,,,,,,,,,,,,,,,,,,,,
10524460,2020,2017/15457361,2017,1,1,1,1,1,KONITZER MANUFACTURING LLC,0,US,Chilton,WI,Calumet,A G,2,2,2,0,hnogh3jglfnrlnylg47vreu8p,1,Kevin David Konitzer,bpy2em68l8eeaxhqzizk34ai5,1,William Charles Konitzer,,,,,,,,,,,,,,,,,,,,,,0
10524461,2020,2018/16141519,2018,1,0,0,1,1,,0,,,,,A G,3,1,1,0,fl:ja_ln:files-4,1,Jace W. Files,fl:jo_ln:morrison-22,,John Trevor Morrison,fl:sh_ln:naimpally-1,,Shivshanker Somashekar Naimpally,,,,,,,,,,,,,,,,,,,
10524462,2020,2017/15613730,2017,1,0,0,1,1,,0,,,,,A,1,1,1,0,fl:mi_ln:sapienza-1,1,Michael Sapienza,,,,,,,,,,,,,,,,,,,,,,,,,
10524463,2020,2018/15886861,2018,1,0,0,1,1,,0,,,,,A,1,1,1,0,fl:no_ln:bougie-1,1,Normand Bougie,,,,,,,,,,,,,,,,,,,,,,,,,
10524464,2020,2019/16293846,2019,1,0,0,1,1,,0,,,,,A,1,1,1,0,fl:pa_ln:cook-10,1,Paul F. Cook,,,,,,,,,,,,,,,,,,,,,,,,,
10524465,2020,2016/15374382,2016,1,0,0,1,1,,0,,,,,A,2,2,2,0,fl:jo_ln:kovarik-3,1,Joseph E. Kovarik,fl:je_ln:franek-1,1,Jeff Franek,,,,,,,,,,,,,,,,,,,,,,
10524466,2020,2016/16324000,2016,1,1,1,1,1,"HALLIBURTON ENERGY SERVICES, INC.",0,US,Houston,TX,Harris County,A G,2,2,2,0,fl:wo_ln:nitsche-2,1,Wolfgang Hartmut Nitsche,fl:jo_ln:maida-1,1,John L. Maida,,,,,,,,,,,,,,,,,,,,,,0
10524467,2020,2018/15864916,2018,1,0,0,1,1,,0,,,,,A,1,1,1,0,fl:ma_ln:garis-1,1,Matthew A Garis,,,,,,,,,,,,,,,,,,,,,,,,,
10524468,2020,2016/15574996,2016,1,1,1,1,1,"ISHIHARA SANGYO KAISHA, LTD.",0,JP,Osaka,,,A,2,2,2,0,fl:yu_ln:ishibashi-10,1,Yutaka Ishibashi,fl:yu_ln:takigami-3,1,Yusuke Takigami,,,,,,,,,,,,,,,,,,,,,,0
10524469,2020,2016/15546910,2016,1,1,1,1,1,UNIVERSIDAD TECNICA FEDERICO SANTA MARIA,0,CL,Valparaíso,,,A C,5,5,4,1,fl:ka_ln:diazperalta-1,0,Katy Paulina Diaz Peralta,fl:lu_ln:espinozacatalan-1,1,Luis Javier Espinoza Catalan,fl:fl_ln:oleacarrasco-1,1,Floreal Andres Olea Carrasco,fl:hu_ln:penacortes-1,1,Hugo Alberto Peña Cortes,fl:la_ln:taborgamorales-1,1,Lautaro Liber Taborga Morales,,,,,,,,,,,,,0
10524470,2020,2017/15623024,2017,1,1,1,1,1,ECOLAB INC.,0,US,Saint Paul,MN,Ramsey,A,8,5,4,1,fl:ju_ln:li-19,,Junzhong Li,fl:cy_ln:bunders-1,0,Cynthia Bunders,fl:ri_ln:staub-3,,Richard Staub,fl:pa_ln:schacht-1,1,Paul Frazer Schacht,fl:ca_ln:power-1,1,Caleb Power,fl:ra_ln:balasubramanian-30,1,Ramakrishnan Balasubramanian,fl:ro_ln:ryther-2,,Robert J. Ryther,fl:ca_ln:hanson-9,1,Catherine Hanson,,,,0
10524471,2020,2018/16048142,2018,1,1,1,1,1,KING ABDULLAH UNIVERSITY OF SCIENCE AND TECHNOLOGY,0,SA,Thuwal,,,A,3,1,1,0,fl:he_ln:hirt-2,,Heribert Hirt,fl:ax_ln:dezelicourt-1,1,Axel de Zelicourt,fl:ma_ln:saad-1,,Maged Saad,,,,,,,,,,,,,,,,,,,0
10524472,2020,2016/15179453,2016,1,1,1,1,1,"PLANT HEALTH CARE, INC.",0,US,Raleigh,NC,Wake County,A C,2,2,2,0,fl:zh_ln:wei-19,1,Zhongmin Wei,fl:gr_ln:zornetzer-1,1,Gregory A. Zornetzer,,,,,,,,,,,,,,,,,,,,,,0
10524473,2020,2016/15244919,2016,1,1,1,1,1,"PLANT HEALTH CARE, INC.",0,US,Raleigh,NC,Wake County,A C,2,2,2,0,fl:zh_ln:wei-19,1,Zhongmin Wei,fl:gr_ln:zornetzer-1,1,Gregory A. Zornetzer,,,,,,,,,,,,,,,,,,,,,,0
10524474,2020,2013/13861819,2013,1,1,1,1,1,SYNGENTA PARTICIPATIONS AG,0,CH,Basel,,,A,2,2,2,0,fl:jo_ln:james-15,1,John Robert James,fl:mi_ln:agnew-1,1,Michael Agnew,,,,,,,,,,,,,,,,,,,,,,0
10524475,2020,2015/14950588,2015,1,1,1,1,1,BAYER CROPSCIENCE AG,0,DE,Monheim,,,A,7,7,7,0,fl:di_ln:feucht-1,1,Dieter Feucht,fl:pe_ln:dahmen-6,1,Peter Dahmen,fl:ma_ln:drewes-3,1,Mark Wilhelm Drewes,fl:ro_ln:pontzen-1,1,Rolf Pontzen,fl:er_ln:gesing-1,1,Ernst Rudolf F. Gesing,fl:ha_ln:schwarz-2,1,Hans-Georg Schwarz,fl:kl_ln:mueller-1,1,Klaus-Helmur Mueller,,,,,,,0
10524477,2020,2017/15817139,2017,1,1,1,1,1,SNIPR TECHNOLOGIES LIMITED,0,GB,London,,,A C,5,5,5,0,fl:ja_ln:clube-1,1,Jasper Clube,fl:mo_ln:sommer-2,1,Morten Sommer,fl:ch_ln:grndahl-1,1,Christian GRØNDAHL,fl:er_ln:vanderhelm-1,1,Eric VAN DER HELM,fl:ru_ln:vazquezuribe-1,1,Ruben VAZQUEZ-URIBE,,,,,,,,,,,,,0
10524478,2020,2015/15129133,2015,1,1,1,1,1,HAAS FOOD EQUIPMENT GMBH,0,AT,Wien,,,A,8,8,7,1,fl:ma_ln:bibaric-1,1,Markus Bibaric,fl:pe_ln:buczolits-1,1,Peter Buczolits,fl:jo_ln:haas-30,1,Johannes Haas,fl:jo_ln:haas-29,0,Josef Haas,fl:st_ln:jiraschek-1,1,Stefan Jiraschek,fl:ka_ln:knirsch-1,1,Karl Knirsch,fl:ma_ln:scheller-2,1,Markus Scheller,fl:mi_ln:schuck-1,1,Michael Schuck,,,,0
10524479,2020,2017/15622368,2017,1,1,1,1,1,"SOLBERN, INC.",0,US,Fairfield,NJ,Essex,A,2,0,0,0,fl:th_ln:berger-7,,Thomas G. Berger,fl:mo_ln:shtilerman-1,,Moysey Shtilerman,,,,,,,,,,,,,,,,,,,,,,0
10524480,2020,2017/15424286,2017,1,0,0,1,1,,0,,,,,A B F,1,1,1,0,fl:da_ln:maestas-1,1,David Maestas,,,,,,,,,,,,,,,,,,,,,,,,,
10524481,2020,2017/15857773,2017,1,1,1,1,1,JARVIS PRODUCTS CORPORATION,0,US,Middletown,CT,Middlesex,A,1,1,1,0,fl:gr_ln:hanson-5,1,Gregory J. Hanson,,,,,,,,,,,,,,,,,,,,,,,,,0
10524482,2020,2019/16403951,2019,1,1,1,1,1,VEMAG MASCHINENBAU GMBH,0,DE,Verden,,,A,5,4,4,0,fl:ma_ln:mach-3,1,Matthias Mach,fl:ja_ln:hagedorn-2,1,Jan-Nils Hagedorn,fl:he_ln:matthies-2,1,Heiner Matthies,fl:ol_ln:grote-1,1,Olaf Grote,fl:al_ln:lewin-2,,Alexander Lewin,,,,,,,,,,,,,0
10524483,2020,2017/15641958,2017,1,1,1,1,1,"HALL FABRICATION, INC.",0,US,Las Vegas,NV,Clark,A F,1,1,1,0,fl:da_ln:chappell-8,1,Dave Chappell,,,,,,,,,,,,,,,,,,,,,,,,,0
10524484,2020,2014/15026407,2014,1,1,1,1,1,BSH BOSCH UND SIEMENS HAUSGERAETE GMBH,0,DE,Munich,,,A F,2,2,1,1,fl:as_ln:klingshirn-1,0,Astrid Klingshirn,fl:be_ln:schessl-1,1,Bernd Schessl,,,,,,,,,,,,,,,,,,,,,,0
10524485,2020,2019/16240879,2019,1,1,1,1,1,"CORN PRODUCTS DEVELOPMENT, INC.",0,US,Westchester,IL,Cook,A,2,2,1,1,fl:do_ln:hanchett-2,1,Douglas J. Hanchett,fl:ch_ln:odorisio-1,0,Christina Odorisio,,,,,,,,,,,,,,,,,,,,,,0
10524486,2020,2019/16415137,2019,1,0,0,1,1,,0,,,,,A G,1,1,1,0,fl:an_ln:feola-1,1,Anthony V. Feola,,,,,,,,,,,,,,,,,,,,,,,,,
10524487,2020,2017/15405247,2017,1,1,1,1,1,CISBAY GLOBAL INC.,0,US,San Jose,CA,Santa Clara,A,1,1,1,0,fl:kh_ln:le-14,1,Khanh Le,,,,,,,,,,,,,,,,,,,,,,,,,0
10524488,2020,2014/15533185,2014,1,1,1,1,1,COLGATE-PALMOLIVE COMPANY,0,US,New York,NY,New York County,A,4,4,2,2,fl:jo_ln:vondran-1,0,Jodi VONDRAN,fl:de_ln:jewell-3,1,Dennis Jewell,fl:ki_ln:panickar-1,0,Kiran PANICKAR,fl:da_ln:scherl-1,1,Dale Scherl,,,,,,,,,,,,,,,,0
10524489,2020,2017/15647944,2017,1,1,1,1,1,ZINPRO CORPORATION,0,US,Eden Prairie,MN,Hennepin County,A,1,1,1,0,fl:pe_ln:stark-2,1,Peter A. Stark,,,,,,,,,,,,,,,,,,,,,,,,,0
10524490,2020,2017/15599954,2017,1,1,1,1,1,"TIMBERFISH, LLC",0,US,Amherst,NY,Amherst Town,A B C,1,1,1,0,fl:je_ln:northrop-1,1,Jere Northrop,,,,,,,,,,,,,,,,,,,,,,,,,0
10524491,2020,2017/15808110,2017,1,1,1,1,1,FLAVORSEAL LLC,0,US,Avon,OH,Lorain,A B,6,5,3,2,fl:a._ln:eskamani-1,,A. Gus ESKAMANI,fl:me_ln:dorenkott-1,0,Melanie DORENKOTT,fl:ti_ln:suttongilbert-1,0,Tiffani A. SUTTON-GILBERT,fl:mi_ln:kaminski-9,1,Michael G. Kaminski,fl:mi_ln:pintz-1,1,Michael Pintz,fl:ed_ln:nolan-1,1,Ed Nolan,,,,,,,,,,0
10524492,2020,2017/15400445,2017,1,1,1,1,1,"CORN PRODUCTS DEVELOPMENT, INC.",0,US,Westchester,IL,Cook,A C,4,4,3,1,fl:ho_ln:jiang-3,1,Hongxin Jiang,fl:br_ln:ostrander-1,1,Brad Ostrander,fl:xi_ln:yang-172,0,Xin Yang,fl:ch_ln:lane-12,1,Christopher Lane,,,,,,,,,,,,,,,,0
10524493,2020,2014/14487592,2014,1,1,1,1,1,THE JOHNS HOPKINS UNIVERSITY,0,US,Baltimore,MD,Baltimore city,A C,7,7,5,2,fl:an_ln:feldman-7,1,Andrew B. Feldman,fl:je_ln:lin-91,0,Jeffrey S. Lin,fl:ke_ln:schwab-3,1,Kellogg Schwab,fl:ti_ln:julian-1,1,Timothy Julian,fl:ch_ln:wobus-1,0,Christiane Wobus,fl:da_ln:weitz-1,1,David A. Weitz,fl:jo_ln:heyman-1,1,John Heyman,,,,,,,0
10524494,2020,2013/14370307,2013,1,0,0,1,1,,0,,,,,A,1,1,1,0,fl:al_ln:bertocchi-1,1,Alessandro Bertocchi,,,,,,,,,,,,,,,,,,,,,,,,,
10524495,2020,2015/14805239,2015,1,1,1,1,1,"NUC ELECTRONICS CO., LTD.",0,KR,Daegu,,,A,7,4,3,1,fl:jo_ln:kim-186,1,Jong Boo Kim,fl:ji_ln:kim-260,,Ji Tae Kim,fl:o_ln:kwon-20,1,O Jung Kwon,fl:yo_ln:kim-251,0,Young Dong Kim,fl:ch_ln:kim-731,,Chan Yeol Kim,fl:ho_ln:lee-203,1,Ho Seok Lee,fl:se_ln:lee-187,,Seung Hee Lee,,,,,,,0
10524496,2020,2014/15022205,2014,1,1,1,1,1,BREVILLE PTY LIMITED,0,AU,Forbes,,,A,4,4,3,1,fl:ke_ln:hensel-1,1,Keith James Hensel,fl:ni_ln:edmonds-1,1,Nicholas Edmonds,fl:kh_ln:thai-2,0,Khon Thai,fl:sa_ln:adeloju-1,1,Samuel Adeloju,,,,,,,,,,,,,,,,0
10524497,2020,2015/14657560,2015,1,1,1,1,1,"CORNELL RESEARCH FOUNDATION, INC.",0,US,Ithaca,NY,Ithaca Town,A,2,1,1,0,fl:sy_ln:rizvi-9,1,Syed S. H. Rizvi,fl:il_ln:paraman-1,,Ilankovan Paraman,,,,,,,,,,,,,,,,,,,,,,0
10524498,2020,2014/15023610,2014,1,1,1,1,1,BRITISH AMERICAN TOBACCO (INVESTMENTS) LIMITED,0,GB,London,,,A G,4,3,3,0,fl:ju_ln:white-14,1,Julian WHITE,fl:ma_ln:horrod-1,1,Martin HORROD,fl:an_ln:bray-7,,Andrew Jonathan Bray,fl:ga_ln:fallon-1,1,Gary Fallon,,,,,,,,,,,,,,,,0
10524499,2020,2018/15959052,2018,1,0,0,1,1,,0,,,,,A,1,1,1,0,fl:jo_ln:wander-1,1,Joseph M. Wander,,,,,,,,,,,,,,,,,,,,,,,,,
10524500,2020,2016/15179413,2016,1,1,1,1,1,R. J. REYNOLDS TOBACCO COMPANY,0,US,Winston-Salem,NC,Forsyth County,A,2,2,2,0,fl:an_ln:sebastian-1,1,Andries Don Sebastian,fl:ev_ln:crooks-2,1,Evon Llewellyn Crooks,,,,,,,,,,,,,,,,,,,,,,0
10524501,2020,2016/15551834,2016,1,1,1,1,1,JT INTERNATIONAL S.A.,0,CH,,,,A,1,1,1,0,fl:no_ln:fujita-11,1,Noritoshi Fujita,,,,,,,,,,,,,,,,,,,,,,,,,0
10524502,2020,2018/16143961,2018,1,1,1,1,1,HEALTHIER CHOICES MANAGEMENT CORP.,0,US,Hollywood,FL,Broward,A,3,3,3,0,fl:ed_ln:balder-2,1,Edwin Balder,fl:gi_ln:cyphert-1,1,Gilbert Cyphert,fl:da_ln:julia-1,1,Daniel Julia,,,,,,,,,,,,,,,,,,,0
10524503,2020,2015/15513170,2015,1,1,1,1,1,PHILIP MORRIS PRODUCTS S.A.,0,CH,Neuchâtel,,,A,4,3,3,0,fl:di_ln:florack-1,,Dionisius Elisabeth Antonius Florack,fl:ev_ln:jochnowitz-1,1,Evan Jochnowitz,fl:an_ln:kolyris-1,1,Angelos Kolyris,fl:ke_ln:fernando-1,1,Keethan Dasnavis FERNANDO,,,,,,,,,,,,,,,,0
10524504,2020,2015/14797089,2015,1,1,1,1,1,"SHENZHEN FIRST UNION TECHNOLOGY CO., LTD.",0,CN,Riverview Drive,,,A F H,3,1,1,0,fl:yo_ln:li-52,,Yonghai Li,fl:zh_ln:xu-113,,Zhongli Xu,fl:sh_ln:hu-235,1,SHUYUN HU,,,,,,,,,,,,,,,,,,,0
10524505,2020,2015/14819946,2015,1,1,1,1,1,ALTRIA CLIENT SERVICES LLC,0,US,Richmond,VA,Richmond city,A F H,1,1,1,0,fl:ja_ln:keen-5,1,Jarrett KEEN,,,,,,,,,,,,,,,,,,,,,,,,,0
10524506,2020,2015/14849894,2015,1,1,1,1,1,JAPAN TOBACCO INC.,0,JP,Tokyo,,,A F,4,3,3,0,fl:ta_ln:nakano-27,1,Takuma NAKANO,fl:at_ln:yamada-4,1,Atsuro Yamada,fl:ta_ln:akiyama-22,,Takeshi Akiyama,fl:ma_ln:yamada-28,1,Manabu Yamada,,,,,,,,,,,,,,,,0
10524507,2020,2014/15114084,2014,1,0,0,1,1,,0,,,,,A F,1,1,1,0,fl:ar_ln:medinarivero-1,1,Armando MEDINA RIVERO,,,,,,,,,,,,,,,,,,,,,,,,,
10524508,2020,2016/15352153,2016,1,1,1,1,1,"RAI STRATEGIC HOLDINGS, INC.",0,US,Winston-Salem,NC,Forsyth County,A H,4,3,3,0,fl:ra_ln:sur-1,1,Rajesh Sur,fl:ja_ln:rogers-4,1,James William Rogers,fl:st_ln:sears-4,1,Stephen Benson Sears,fl:er_ln:hunt-2,,Eric Taylor Hunt,,,,,,,,,,,,,,,,0
10524509,2020,2016/15355748,2016,1,1,1,1,1,"RAI STRATEGIC HOLDINGS, INC.",0,US,Winston-Salem,NC,Forsyth County,A H,3,2,2,0,fl:ra_ln:sur-1,1,Rajesh Sur,fl:er_ln:hunt-2,,Eric Taylor Hunt,fl:st_ln:sears-4,1,Stephen Benson Sears,,,,,,,,,,,,,,,,,,,0
10524510,2020,2017/15643552,2017,1,1,1,1,1,"FUNAI ELECTRIC CO., LTD.",0,JP,,,,A F H,1,1,1,0,fl:by_ln:bell-1,1,Byron V. Bell,,,,,,,,,,,,,,,,,,,,,,,,,0
10524511,2020,2017/15815223,2017,1,1,1,1,1,"RAI STRATEGIC HOLDINGS, INC.",0,US,Winston-Salem,NC,Forsyth County,A,5,5,5,0,fl:st_ln:worm-4,1,Steven L. Worm,fl:mi_ln:galloway-1,1,Michael Ryan Galloway,fl:fr_ln:ampolini-1,1,Frederic Philippe Ampolini,fl:ra_ln:mcknight-1,1,Randy Lee McKnight,fl:da_ln:christopherson-3,1,David Glen Christopherson,,,,,,,,,,,,,0
10524512,2020,2018/15988597,2018,1,1,1,1,1,"RAI STRATEGIC HOLDINGS, INC.",0,US,Winston-Salem,NC,Forsyth County,A,9,8,7,1,fl:an_ln:sebastian-1,1,Andries Don Sebastian,fl:ka_ln:taluskie-1,0,Karen V. Taluskie,fl:st_ln:sears-4,1,Stephen Benson Sears,fl:br_ln:ingebrethsen-1,1,Bradley J. Ingebrethsen,fl:ba_ln:ademe-1,,Balager Ademe,fl:st_ln:alderman-3,1,Steven Lee Alderman,fl:wi_ln:collett-1,1,William Robert Collett,fl:gr_ln:dooly-1,1,Grady Lance Dooly,fl:ch_ln:novak-2,1,"Charles Jacob Novak, III",0
10524513,2020,2018/16132654,2018,1,1,1,1,1,ALTRIA CLIENT SERVICES LLC,0,US,Richmond,VA,Richmond city,A,1,1,1,0,fl:er_ln:force-1,1,Eric Force,,,,,,,,,,,,,,,,,,,,,,,,,0