patent_number,grant_year,application_number,application_year,d_inventor,d_assignee,d_location,d_application,d_ipc,assignee,assignee_ind,country,city,state,county,ipc_section,team_size,inventors,men_inventors,women_inventors,inventor_id1,male_flag1,inventor_name1,inventor_id2,male_flag2,inventor_name2,inventor_id3,male_flag3,inventor_name3,inventor_id4,male_flag4,inventor_name4,inventor_id5,male_flag5,inventor_name5,inventor_id6,male_flag6,inventor_name6,inventor_id7,male_flag7,inventor_name7,inventor_id8,male_flag8,inventor_name8,inventor_id9,male_flag9,inventor_name9,assignee_sequence
10881042,2021,2019/16367947,2019,1,1,1,1,1,"SUMMERS MANUFACTURING COMPANY, INC.",0,US,Devils Lake,ND,Ramsey,A,1,1,1,0,fl:tr_ln:westlind-1,1,Travis Erlin Westlind,,,,,,,,,,,,,,,,,,,,,,,,,0
10881043,2021,2018/16196110,2018,1,1,0,1,1,"MENDELOVA UNIVERZITA V BRNE. AGRONOMICKA FAKULTA, USTAV TECHNIKY A AUTOMOBILOVE DOPRAVY",0,,,,,A B,5,5,5,0,fl:fr_ln:bauer-4,1,Frantisek Bauer,fl:ji_ln:cupera-1,1,Jiri Cupera,fl:ma_ln:fajman-1,1,Martin Fajman,fl:ma_ln:zak-4,1,Marek Zak,fl:ad_ln:polcar-1,1,Adam Polcar,,,,,,,,,,,,,0
10881044,2021,2018/16050792,2018,1,1,1,1,1,AGCO CORPORATION,0,US,Duluth,GA,Gwinnett,A,2,2,2,0,fl:be_ln:fanshier-1,1,Benjamin Anson Fanshier,fl:mo_ln:rans-1,1,Monte J. Rans,,,,,,,,,,,,,,,,,,,,,,0
10881045,2021,2016/16081327,2016,1,1,1,1,1,NUTRIEN AG SOLUTIONS (CANADA) INC.,0,CA,Calgary,AB,,A G,4,4,3,1,fl:th_ln:staples-2,1,Thomas Edward Staples,fl:re_ln:miller-7,1,Regan Charles Miller,fl:me_ln:hoosein-1,0,Mehzabeen Hoosein,fl:mi_ln:finn-2,1,Michael V. Finn,,,,,,,,,,,,,,,,0
10881046,2021,2016/15280694,2016,1,1,1,1,1,"AGRI-INJECT, INC.",0,US,Wray,CO,Yuma,A,1,1,1,0,fl:er_ln:tribelhorn-1,1,Erik W. Tribelhorn,,,,,,,,,,,,,,,,,,,,,,,,,0
10881047,2021,2018/15996608,2018,1,1,1,1,1,KUBOTA CORPORATION,0,JP,Osaka,,,A,1,1,1,0,fl:ma_ln:yamada-43,1,Masahiro Yamada,,,,,,,,,,,,,,,,,,,,,,,,,0
10881048,2021,2018/16200545,2018,1,1,1,1,1,REKORDVERKEN SWEDEN AB,0,SE,Kvänum,,,A,1,1,1,0,fl:be_ln:holmen-1,1,Bengt Holmén,,,,,,,,,,,,,,,,,,,,,,,,,0
10881049,2021,2018/16170641,2018,1,1,1,1,1,DEERE & COMPANY,0,US,Moline,IL,Rock Island,A,3,3,3,0,fl:pa_ln:gresset-1,1,Pascal Gresset,fl:ro_ln:repecaud-1,1,Romain Repecaud,fl:ma_ln:dutertre-1,1,Matthieu Dutertre,,,,,,,,,,,,,,,,,,,0
10881050,2021,2016/15388262,2016,1,1,1,1,1,AGCO CORPORATION,0,US,Duluth,GA,Gwinnett,A,2,2,2,0,fl:ro_ln:figger-1,1,Robert L. Figger,fl:ke_ln:hamilton-3,1,Kevin J. Hamilton,,,,,,,,,,,,,,,,,,,,,,0
10881051,2021,2018/16114088,2018,1,1,1,1,1,"AGNETIX, INC.",0,US,San Diego,CA,San Diego,A F,2,2,2,0,fl:ih_ln:lys-1,1,Ihor Lys,fl:ni_ln:maderas-1,1,Nicholas Maderas,,,,,,,,,,,,,,,,,,,,,,0
10881052,2021,2019/16718661,2019,1,1,1,1,1,ARTLED TECHNOLOGY CORP.,0,TW,Taoyuan,,,A F,1,1,1,0,fl:ch_ln:tsao-100,1,Chia-Tsung Tsao,,,,,,,,,,,,,,,,,,,,,,,,,0
10881053,2021,2016/15746015,2016,1,1,1,1,1,DANIEL KERSCHGENS,1,AT,Wien,,,A,2,2,2,0,fl:da_ln:kerschgens-1,1,Daniel Kerschgens,fl:he_ln:russwurm-1,1,Heinz Georg Russwurm,,,,,,,,,,,,,,,,,,,,,,0
10881054,2021,2020/16807472,2020,1,1,1,1,1,AVINTIV SPECIALTY MATERIALS INC.,0,US,Charlotte,NC,Mecklenburg County,A B D,2,2,1,1,fl:ro_ln:pano-1,1,Robert Garcia Pano,fl:ma_ln:burckel-1,0,Marie-Pierre Burckel,,,,,,,,,,,,,,,,,,,,,,0
10881055,2021,2019/16265164,2019,1,1,1,1,1,"BYO HOLDINGS, LLC",0,US,Koshkonong,MO,Oregon,A C,2,1,1,0,fl:an_ln:miller-19,1,Andrew Hines Miller,fl:jo_ln:rubin-15,,Jordan Seth Rubin,,,,,,,,,,,,,,,,,,,,,,0
10881056,2021,2013/15035990,2013,1,1,0,1,1,SUZANO S.A.,0,,,,,A,3,3,3,0,fl:ri_ln:penchel-1,1,Ricardo Miguel PENCHEL,fl:jo_ln:reis-4,1,Jocemar Palauro dos REIS,fl:mi_ln:oliveira-1,1,Mila Liparize de OLIVEIRA,,,,,,,,,,,,,,,,,,,0
10881057,2021,2019/16276615,2019,1,1,1,1,1,MONSANTO COMPANY,0,US,Chesterfield,MO,St. Louis,A C,6,6,5,1,fl:pa_ln:cannon-7,1,Paul Cannon,fl:ed_ln:cargill-2,1,Edward J. Cargill,fl:ch_ln:foresman-1,1,Charles T. Foresman,fl:mi_ln:hall-26,0,Michael Hall,fl:sc_ln:johnson-11,1,Scott C. Johnson,fl:jo_ln:miklos-2,1,John A. Miklos,,,,,,,,,,0
10881058,2021,2016/15772752,2016,1,1,1,1,1,"TIANJIN NANKAI UNIVERSITY CASTOR ENGINEERING SCIENCE AND TECHNOLOGY CO., LTD",0,CN,Tianjin,,,A C,5,3,2,1,fl:xi_ln:li-43,,Xiulan Li,fl:li_ln:chen-409,1,Li Chen,fl:fe_ln:ye-6,,Feng Ye,fl:li_ln:dong-32,0,Lijian Dong,fl:gu_ln:wang-106,1,Guangming Wang,,,,,,,,,,,,,0
10881059,2021,2019/16509967,2019,1,1,0,1,1,"PIONEER HI-BRED INTERNATIONAL, INC.",0,,,,,A,3,3,3,0,fl:ma_ln:arbelbide-1,1,Martin Arbelbide,fl:gu_ln:garcia-5,1,Gustavo Marcelo Garcia,fl:ju_ln:zhang-1,1,Julia Xiuling Zhang,,,,,,,,,,,,,,,,,,,0
10881060,2021,2015/14692094,2015,1,1,1,1,1,AGRICULTURE VICTORIA SERVICES PTY LTD,0,AU,Melbourne,,,A C,9,8,3,5,fl:ge_ln:spangenberg-2,1,German Spangenberg,fl:ka_ln:guthridge-2,0,Kathryn Michaela Guthridge,fl:jo_ln:forster-2,1,John White Forster,fl:ti_ln:sawbridge-2,1,Timothy Ivor Sawbridge,fl:em_ln:ludlow-1,0,Emma Jane Isobel Ludlow,fl:ja_ln:kaur-5,0,Jatinder Kaur,fl:si_ln:rochfort-1,0,Simone Jane Rochfort,fl:ma_ln:rabinovich-1,0,Maia Andrea Rabinovich,fl:pi_ln:ekanayake-1,,Piyumi Ekanayake,0
10881061,2021,2019/16354985,2019,1,1,1,1,1,"HM.CLAUSE, S.A.",0,FR,Portes-lès-Valence,,,A,1,1,1,0,fl:ju_ln:mazet-1,1,Julien Mazet,,,,,,,,,,,,,,,,,,,,,,,,,0
10881062,2021,2019/16509729,2019,1,1,0,1,1,"PIONEER HI-BRED INTERNATIONAL, INC.",0,,,,,A,2,1,1,0,fl:ma_ln:hoffbeck-1,1,Mark David Hoffbeck,fl:an_ln:ross-6,,Andrew Jon Ross,,,,,,,,,,,,,,,,,,,,,,0
10881063,2021,2019/16509952,2019,1,1,0,1,1,"PIONEER HI-BRED INTERNATIONAL, INC.",0,,,,,A,1,0,0,0,fl:an_ln:ross-6,,Andrew Jon Ross,,,,,,,,,,,,,,,,,,,,,,,,,0
10881064,2021,2019/16509962,2019,1,1,0,1,1,"PIONEER HI-BRED INTERNATIONAL, INC.",0,,,,,A,5,4,4,0,fl:ja_ln:benson-1,1,Jared Benson,fl:da_ln:fischer-3,1,David B Fischer,fl:ma_ln:hoffbeck-1,1,Mark David Hoffbeck,fl:am_ln:jacobson-1,1,Amy Jean Jacobson,fl:an_ln:ross-6,,Andrew Jon Ross,,,,,,,,,,,,,0
10881065,2021,2019/16510010,2019,1,1,0,1,1,"PIONEER HI-BRED INTERNATIONAL, INC.",0,,,,,A,1,1,1,0,fl:jo_ln:gogerty-2,1,Joseph Kevin Gogerty,,,,,,,,,,,,,,,,,,,,,,,,,0
10881066,2021,2019/16510031,2019,1,1,0,1,1,"PIONEER HI-BRED INTERNATIONAL, INC.",0,,,,,A,2,2,2,0,fl:mi_ln:chandler-2,1,Michael Adam Chandler,fl:jo_ln:gogerty-2,1,Joseph Kevin Gogerty,,,,,,,,,,,,,,,,,,,,,,0
10881067,2021,2019/16510034,2019,1,1,0,1,1,"PIONEER HI-BRED INTERNATIONAL, INC.",0,,,,,A,8,7,7,0,fl:ca_ln:cabral-3,1,Candida Braga Cabral,fl:ma_ln:fabrizius-1,1,Martin A. Fabrizius,fl:ni_ln:haase-2,,Nicholas James Haase,fl:ju_ln:ho-35,1,Julie Ho,fl:jo_ln:pace-1,1,Jordon Michael Pace,fl:ch_ln:schaefer-1,1,Christopher Michael Schaefer,fl:ma_ln:smalley-2,1,Matthew David Smalley,fl:st_ln:szalma-1,1,Stephen Joseph Szalma,,,,0
10881068,2021,2019/16510057,2019,1,1,0,1,1,"PIONEER HI-BRED INTERNATIONAL, INC.",0,,,,,A,7,6,6,0,fl:br_ln:devries-2,1,Brian Douglas De Vries,fl:jo_ln:gogerty-2,1,Joseph Kevin Gogerty,fl:ed_ln:grote-1,1,Edwin Michael Grote,fl:wa_ln:odland-1,1,Wade Eugene Odland,fl:ch_ln:rasmussen-11,1,Christopher Cole Rasmussen,fl:er_ln:riedeman-1,1,Eric Scott Riedeman,fl:an_ln:ross-6,,Andrew Jon Ross,,,,,,,0
10881069,2021,2019/16510062,2019,1,1,0,1,1,"PIONEER HI-BRED INTERNATIONAL, INC.",0,,,,,A,1,1,1,0,fl:mi_ln:chandler-2,1,Michael Adam Chandler,,,,,,,,,,,,,,,,,,,,,,,,,0
10881070,2021,2019/16510067,2019,1,1,0,1,1,"PIONEER HI-BRED INTERNATIONAL, INC.",0,,,,,A,10,9,8,1,fl:jo_ln:anderson-93,,Joseph D. Anderson,fl:te_ln:colbert-1,1,Terry R. Colbert,fl:ma_ln:gadlage-1,1,Mark Jacob Gadlage,fl:da_ln:gorman-2,1,Daniel Preston Gorman,fl:th_ln:henry-2,1,Thomas Russell Henry,fl:ji_ln:lennon-1,1,Jill Renee Lennon,fl:ka_ln:madden-6,0,Katherine Lisko Madden,fl:na_ln:o'berry-1,1,Nathan Brook O'Berry,fl:ja_ln:prothro-1,1,Jason Michael Prothro,0
10881071,2021,2019/16510084,2019,1,1,0,1,1,"PIONEER HI-BRED INTERNATIONAL, INC.",0,,,,,A,6,6,5,1,fl:ru_ln:fox-1,1,Russell L. Fox,fl:el_ln:heffner-1,1,Elliot Lee Heffner,fl:ga_ln:henke-1,1,Gary Edward Henke,fl:sa_ln:lira-1,0,Sara Jane Lira,fl:go_ln:srnic-1,1,Goran Srnic,fl:ta_ln:tarnowski-1,1,Tara Luana Barrett Tarnowski,,,,,,,,,,0
10881072,2021,2019/16359690,2019,1,1,1,1,1,"UNIVERSITY OF GEORGIA RESEARCH FOUNDATION, INC.",0,US,Athens,GA,Clarke,A,5,4,4,0,fl:ze_ln:li-2,,Zenglu Li,fl:ed_ln:wood-8,1,Edwin D. Wood,fl:h._ln:boerma-1,1,H. Roger Boerma,fl:ja_ln:noe-3,1,James P. Noe,fl:ja_ln:buck-2,1,James W. Buck,,,,,,,,,,,,,0
10881073,2021,2019/16525672,2019,1,1,1,1,1,MONSANTO COMPANY,0,US,Chesterfield,MO,St. Louis,A,1,1,1,0,fl:ca_ln:carlson-17,1,Carrin Carlson,,,,,,,,,,,,,,,,,,,,,,,,,0
10881074,2021,2019/16525676,2019,1,1,1,1,1,MONSANTO COMPANY,0,US,Chesterfield,MO,St. Louis,A,1,1,1,0,fl:ca_ln:carlson-17,1,Carrin Carlson,,,,,,,,,,,,,,,,,,,,,,,,,0
10881075,2021,2019/16534510,2019,1,1,1,1,1,"M.S. TECHNOLOGIES, L.L.C.",0,US,West Point,IA,Lee,A,1,1,1,0,fl:ju_ln:mason-1,1,Justin T. Mason,,,,,,,,,,,,,,,,,,,,,,,,,0
10881076,2021,2017/15627885,2017,1,0,0,1,1,,0,,,,,A,2,2,2,0,fl:do_ln:stevens-18,1,Doug Stevens,fl:sc_ln:stevens-5,1,Scott Stevens,,,,,,,,,,,,,,,,,,,,,,
10881077,2021,2016/15298971,2016,1,1,1,1,1,SOCIéTé DES PRODUITS NESTLé S.A.,0,CH,Vevey,,,A B,3,3,3,0,fl:na_ln:huck-1,1,Nathan Foster Huck,fl:co_ln:muscroft-1,1,Colin Muscroft,fl:da_ln:leinart-1,1,David Odell Leinart,,,,,,,,,,,,,,,,,,,0
10881078,2021,2019/16285095,2019,1,1,1,1,1,"EDMONDS OUTDOORS, LLC",0,US,Nashville,TN,Davidson,A,1,1,1,0,fl:ad_ln:edmonds-2,1,Addison Edmonds,,,,,,,,,,,,,,,,,,,,,,,,,0
10881079,2021,2015/14623974,2015,1,1,1,1,1,"MID-WEST METAL PRODUCTS CO., INC.",0,US,Muncie,IN,Delaware,A,4,3,3,0,fl:br_ln:cantwell-4,,Brad Cantwell,fl:st_ln:kerr-10,1,Stew Kerr,fl:mi_ln:greene-8,1,Michael E. Greene,fl:te_ln:jones-4,1,Terrance L. Jones,,,,,,,,,,,,,,,,0
10881080,2021,2016/16300678,2016,1,1,1,1,1,UNI-CHARM CORPORATION,0,JP,Ozu,,,A,1,1,1,0,fl:da_ln:komatsubara-1,1,Daisuke Komatsubara,,,,,,,,,,,,,,,,,,,,,,,,,0
10881081,2021,2016/15187132,2016,1,1,1,1,1,ASPIRE FOOD GROUP LTD,0,CA,Toronto,ON,,A B G,3,3,3,0,fl:mi_ln:hall-10,1,Michael Todd Hall,fl:ga_ln:mott-2,1,Gabriel Mott,fl:mo_ln:ashour-3,1,Mohammed Ashour,,,,,,,,,,,,,,,,,,,0
10881082,2021,2018/15992468,2018,1,0,0,1,1,,0,,,,,A,1,1,1,0,fl:re_ln:mills-3,1,Renee Mills,,,,,,,,,,,,,,,,,,,,,,,,,
10881083,2021,2018/15899382,2018,1,1,1,1,1,ICTS EUROPE SA,0,FR,Tremblay-en-France,,,A G,2,2,2,0,fl:or_ln:sapir-1,1,Oren Sapir,fl:al_ln:goldblatt-1,1,Allen GOLDBLATT,,,,,,,,,,,,,,,,,,,,,,0
10881084,2021,2011/13818184,2011,1,1,1,1,1,"TRIANNI, INC.",0,US,San Francisco,CA,San Francisco,A C,2,2,2,0,fl:ma_ln:wabl-1,1,Matthias Wabl,fl:ni_ln:killeen-1,1,Nigel Killeen,,,,,,,,,,,,,,,,,,,,,,0
10881085,2021,2015/14664765,2015,1,1,1,1,1,"REGENERON PHARMACEUTICALS, INC.",0,US,Tarrytown,NY,Westchester,A C,2,2,0,2,fl:ly_ln:macdonald-2,0,Lynn Macdonald,fl:an_ln:murphy-2,0,Andrew J. Murphy,,,,,,,,,,,,,,,,,,,,,,0
10881086,2021,2018/15883477,2018,1,1,1,1,1,"REGENERON PHARMACEUTICALS, INC.",0,US,Tarrytown,NY,Westchester,A C G,4,4,1,3,fl:el_ln:burova-1,0,Elena Burova,fl:ya_ln:tang-13,0,Yajun Tang,fl:ka_ln:lai-1,1,Ka-Man Venus Lai,fl:an_ln:murphy-2,0,Andrew J. Murphy,,,,,,,,,,,,,,,,0
10881087,2021,2018/16057030,2018,1,1,1,1,1,"KRIS POULSEN AND ASSOCIATES, LLC",0,US,Shoreline,WA,King,A,1,1,1,0,oq8hyjwdx8fs9o4at8i662jvs,1,Edward Poulsen,,,,,,,,,,,,,,,,,,,,,,,,,0
10881088,2021,2018/16006918,2018,1,1,1,1,1,"DREAMWEAVER LURE COMPANY, INC.",0,US,Ludington,MI,Mason County,A,4,4,4,0,fl:sh_ln:ruboyianes-1,1,Shane Ruboyianes,fl:mi_ln:vandeven-1,1,Michiel van de Ven,fl:ka_ln:chapel-1,1,Karl Chapel,fl:ro_ln:chapel-3,1,Robert Chapel,,,,,,,,,,,,,,,,0
10881089,2021,2019/16539788,2019,1,1,1,1,1,SHIMANO INC.,0,JP,Osaka,,,A,2,2,2,0,fl:ko_ln:ochiai-5,1,Koji Ochiai,fl:mo_ln:niitsuma-1,1,Motohiro Niitsuma,,,,,,,,,,,,,,,,,,,,,,0
10881090,2021,2019/16442410,2019,1,1,1,1,1,SHIMANO COMPONENTS (MALAYSIA) SDN. BHD.,0,MY,Kluang,,,A,1,1,1,0,fl:ch_ln:hui-7,1,Chan Yik Hui,,,,,,,,,,,,,,,,,,,,,,,,,0
10881091,2021,2018/16130180,2018,1,1,1,1,1,"PURE FISHING, INC.",0,US,Spirit Lake,IA,Dickinson,A,2,2,2,0,fl:ca_ln:ivie-2,1,Cameron Ivie,fl:ch_ln:whisnant-1,1,Chandler Whisnant,,,,,,,,,,,,,,,,,,,,,,0
10881092,2021,2017/15662420,2017,1,1,1,1,1,"R&R TACKLE, INC.",0,US,Miami,FL,Miami-Dade,A,2,2,2,0,fl:ra_ln:rosher-1,1,Raymond A. Rosher,fl:ma_ln:marshall-34,1,"Marvin J. Marshall, JR.",,,,,,,,,,,,,,,,,,,,,,0
10881093,2021,2017/15409572,2017,1,1,1,1,1,THE UNITED STATES OF AMERICA AS REPRESENTED BY THE SECRETARY OF THE NAVY,0,US,Arlington,VA,Arlington,A H,1,1,1,0,fl:ja_ln:bertrand-1,1,Jacques C. Bertrand,,,,,,,,,,,,,,,,,,,,,,,,,0
10881094,2021,2018/16156486,2018,1,0,0,1,1,,0,,,,,A,1,1,1,0,fl:to_ln:guo-5,1,Tony Guo,,,,,,,,,,,,,,,,,,,,,,,,,
10881095,2021,2018/16179379,2018,1,1,1,1,1,"UNIVERSITY OF FLORIDA RESEARCH FOUNDATION, INC.",0,US,Gainesville,FL,Alachua,A,2,2,2,0,fl:na_ln:boyd-2,1,Nathan Boyd,fl:ar_ln:schumann-1,1,Arnold W. Schumann,,,,,,,,,,,,,,,,,,,,,,0
10881096,2021,2018/16021090,2018,1,0,0,1,1,,0,,,,,A G,2,2,0,2,fl:je_ln:sweeney-9,0,Jeffrey Paul Sweeney,yqmlz9dbpwno79dd6tjwbor3o,0,Laura Ann Baker-Sweeney,,,,,,,,,,,,,,,,,,,,,,
10881097,2021,2019/16265624,2019,1,1,1,1,1,ECO ELECTRICAL SYSTEMS,0,US,Reno,NV,Washoe,A H,1,1,1,0,fl:mi_ln:lynch-20,1,Michael J. Lynch,,,,,,,,,,,,,,,,,,,,,,,,,0
10881098,2021,2018/16022452,2018,1,1,1,1,1,THE TRUSTEES OF COLUMBIA UNIVERSITY IN THE CITY OF NEW YORK,0,US,New York,NY,New York County,A,4,4,4,0,fl:ja_ln:cook-8,1,James L. Cook,fl:cl_ln:hung-2,1,Clark T. Hung,fl:er_ln:lima-1,1,Eric Lima,fl:aa_ln:stoker-1,1,Aaron M. Stoker,,,,,,,,,,,,,,,,1
10881099,2021,2017/16316637,2017,1,1,1,1,1,DSM IP ASSETS B.V.,0,NL,Heerlen,,,A,1,0,0,0,fl:ma_ln:kumar-23,,Manoj Kumar,,,,,,,,,,,,,,,,,,,,,,,,,0
10881100,2021,2014/14167740,2014,1,1,1,1,1,ROTAM AGROCHEM INTERNATIONAL COMPANY LIMITED,0,CN,Hong Kong,,,A,1,1,1,0,fl:ja_ln:bristow-2,1,James Timothy Bristow,,,,,,,,,,,,,,,,,,,,,,,,,0
10881101,2021,2018/16217895,2018,1,0,0,1,1,,0,,,,,A,1,1,1,0,fl:co_ln:jarrett-3,1,Cody E. Jarrett,,,,,,,,,,,,,,,,,,,,,,,,,
10881102,2021,2016/15572306,2016,1,1,1,1,1,"ZYMTRONIX CATALYTIC SYSTEMS, INC.",0,US,Ithaca,NY,Ithaca Town,A B C,1,1,1,0,fl:st_ln:corgie-1,1,Stephane C. Corgie,,,,,,,,,,,,,,,,,,,,,,,,,0
10881103,2021,2017/15804244,2017,1,1,1,1,1,NATIONAL CHUNG SHAN INSTITUTE OF SCIENCE AND TECHNOLOGY,0,TW,Taoyuan,,,A C,3,2,1,1,fl:ch_ln:fan-82,0,Ching-Wen Fan,fl:we_ln:huang-135,,Wei-Heng Huang,fl:mu_ln:hsu-2,1,MU-NI HSU,,,,,,,,,,,,,,,,,,,0
10881104,2021,2014/14776928,2014,1,1,1,1,1,"TYRATECH, INC.",0,US,Morrisville,NC,Wake County,A,2,2,1,1,fl:ke_ln:kennedy-10,0,Keith Kennedy,fl:ja_ln:schmidt-36,1,Jason Schmidt,,,,,,,,,,,,,,,,,,,,,,0
10881105,2021,2015/15308309,2015,1,1,1,1,1,TAPAZOL CHEMICAL WORKS LTD.,0,IL,Bet Shemesh,,,A,2,1,1,0,fl:ro_ln:cohen-28,,Ron Cohen,fl:pa_ln:liberman-1,1,Pablo Liberman,,,,,,,,,,,,,,,,,,,,,,0
10881106,2021,2017/16345722,2017,1,1,1,1,1,SYNGENTA PARTICIPATIONS AG,0,CH,Basel,,,A C,4,4,3,1,fl:pa_ln:burton-3,1,Paul Matthew BURTON,fl:ed_ln:emmett-1,1,Edward John Emmett,fl:al_ln:smith-53,1,Alexander Smith,fl:lo_ln:whalley-1,0,Louisa Whalley,,,,,,,,,,,,,,,,0
10881107,2021,2016/15752204,2016,1,1,1,1,1,ROOMBIOTIC GMBH,0,AT,Graz,,,A C,3,3,2,1,fl:st_ln:liebminger-1,1,Stefan Liebminger,fl:ga_ln:berg-8,1,Gabriele Berg,fl:la_ln:lange-1,0,Laura E Lange,,,,,,,,,,,,,,,,,,,0
10881108,2021,2020/16744585,2020,1,1,1,1,1,"SUMITOMO CHEMICAL COMPANY, LIMITED",0,JP,Tokyo,,,A,1,1,1,0,fl:yo_ln:sada-1,1,Yoshinao Sada,,,,,,,,,,,,,,,,,,,,,,,,,0
10881109,2021,2019/16251139,2019,1,1,1,1,1,BASF SE,0,DE,Ludwigshafen,,,A,11,11,10,1,fl:jo_ln:hutzler-1,1,Johannes Hutzler,fl:he_ln:kraus-2,1,Helmut Kraus,fl:an_ln:michrowskapianowska-1,0,Anna Aleksandra Michrowska-Pianowska,fl:yo_ln:oturkar-1,1,Yogesh OTURKAR,fl:tr_ln:newton-2,1,Trevor William Newton,fl:st_ln:tresch-1,1,Stefan Tresch,fl:je_ln:lerchl-1,1,Jens Lerchl,fl:th_ln:seitz-6,1,Thomas Seitz,fl:ri_ln:evans-3,1,Richard Roger Evans,0
10881110,2021,2019/16251142,2019,1,1,1,1,1,BASF SE,0,DE,Ludwigshafen,,,A,11,11,10,1,fl:jo_ln:hutzler-1,1,Johannes Hutzler,fl:he_ln:kraus-2,1,Helmut Kraus,fl:an_ln:michrowskapianowska-1,0,Anna Aleksandra Michrowska-Pianowska,fl:yo_ln:oturkar-1,1,Yogesh OTURKAR,fl:tr_ln:newton-2,1,Trevor William Newton,fl:st_ln:tresch-1,1,Stefan Tresch,fl:je_ln:lerchl-1,1,Jens Lerchl,fl:th_ln:seitz-6,1,Thomas Seitz,fl:ri_ln:evans-3,1,Richard Roger Evans,0
10881111,2021,2019/16695470,2019,1,1,1,1,1,JIN JANG,1,KR,Seoul,,,A,2,0,0,0,fl:yo_ln:kim-370,,Yong-Jun Kim,fl:ju_ln:cho-50,,Jung Hyuck Cho,,,,,,,,,,,,,,,,,,,,,,1
10881112,2021,2016/15550739,2016,1,1,1,1,1,GENERALE BISCUIT,0,FR,Clamart,,,A,3,3,3,0,fl:je_ln:dussol-1,1,Jean Maurice Dussol,fl:la_ln:fiot-1,1,Laurent Fiot,fl:de_ln:pujo-1,1,Denis Pujo,,,,,,,,,,,,,,,,,,,0
10881113,2021,2017/15720338,2017,1,1,1,1,1,BURFORD CORPORATION,0,US,Maysville,OK,Garvin,A B,2,2,2,0,fl:sc_ln:clemons-1,1,Scott Clemons,fl:je_ln:pack-6,1,Jerry Pack,,,,,,,,,,,,,,,,,,,,,,0
10881114,2021,2017/15426188,2017,1,1,1,1,1,"GENERAL MILLS, INC.",0,US,Minneapolis,MN,Hennepin,A,4,4,3,1,fl:aa_ln:anand-1,1,Aarti Anand,fl:ca_ln:cammarota-1,0,Carina Claudia Cammarota,fl:xa_ln:murgui-1,1,Xabier Murgui,fl:jo_ln:garcia-1,1,Jonas Plaza Garcia,,,,,,,,,,,,,,,,0
10881115,2021,2020/16997564,2020,1,0,0,1,1,,0,,,,,A,1,1,1,0,icsdj142ozttf5jmhw48qd9rn,1,"James Ronald Inscho, Jr.",,,,,,,,,,,,,,,,,,,,,,,,,
10881116,2021,2018/16105055,2018,1,1,1,1,1,EVER CLEAN AND CLEAR TECHNOLOGIES LTD,0,IL,HaBonim,,,A B,1,1,1,0,fl:sh_ln:rotter-1,1,Shlomo Rotter,,,,,,,,,,,,,,,,,,,,,,,,,0
10881117,2021,2016/15561290,2016,1,1,1,1,1,"CONOPCO, INC.",0,US,Englewood Cliffs,NJ,Bergen,A,3,3,3,0,fl:ge_ln:marinov-1,1,George Simeonov Marinov,fl:jo_ln:mitchell-10,1,John Turner Mitchell,fl:gl_ln:yakubov-1,1,Gleb Yakubov,,,,,,,,,,,,,,,,,,,0
10881118,2021,2015/15512941,2015,1,1,1,1,1,"CONOPCO, INC.",0,US,Englewood Cliffs,NJ,Bergen,A,4,2,1,1,fl:sr_ln:guttapadu-1,,Sreeramulu GUTTAPADU,fl:va_ln:govindaswamy-1,,Vadivel Govindaswamy,fl:mo_ln:jahabardeen-1,1,Mohamed Sirajudeen Jahabardeen,fl:gu_ln:singh-12,0,Gurmeet Singh,,,,,,,,,,,,,,,,0
10881119,2021,2014/14908882,2014,1,1,1,1,1,"MARS, INCORPORATED",0,US,McLean,VA,Fairfax County,A,1,1,0,1,fl:re_ln:robbins-1,0,Rebecca J. Robbins,,,,,,,,,,,,,,,,,,,,,,,,,0
10881120,2021,2016/15265656,2016,1,1,1,1,1,KRAFT FOODS GROUP BRANDS LLC,0,US,Chicago,IL,Cook County,A,4,4,2,2,fl:st_ln:hirt-1,0,Stacey Ann Hirt,fl:an_ln:mcpherson-2,1,Andrew E. McPherson,fl:jo_ln:topinka-1,1,John B. Topinka,fl:ma_ln:cobos-1,0,Maria Del Pilar Cobos,,,,,,,,,,,,,,,,0
10881121,2021,2018/16160469,2018,1,0,0,1,1,,0,,,,,A,1,1,0,1,fl:fu_ln:su-8,0,Fusheng Su,,,,,,,,,,,,,,,,,,,,,,,,,
10881122,2021,2018/15989170,2018,1,0,0,1,1,,0,,,,,A B C,1,1,1,0,fl:ka_ln:jagadevan-1,1,Karthikeyan Jagadevan,,,,,,,,,,,,,,,,,,,,,,,,,
10881123,2021,2017/15795910,2017,1,1,1,1,1,"FRITO-LAY NORTH AMERICA, INC.",0,US,Plano,TX,Collin County,A C,3,2,1,1,fl:me_ln:fevzioglu-1,0,Mehtap Fevzioglu,fl:si_ln:kaliappan-1,,Sivaraj Kaliappan,fl:ja_ln:stalder-1,1,James William Stalder,,,,,,,,,,,,,,,,,,,0
10881124,2021,2015/14965149,2015,1,1,1,1,1,"SHIN-ETSU CHEMICAL CO., LTD.",0,JP,Tokyo,,,A C,5,5,4,1,fl:ak_ln:kitamura-2,1,Akira Kitamura,fl:at_ln:yamamoto-10,0,Atsushi Yamamoto,fl:mi_ln:narita-12,1,Mitsuo Narita,fl:he_ln:nebel-1,1,Heiko Nebel,fl:an_ln:schultz-12,1,Andreas Schultz,,,,,,,,,,,,,0
10881125,2021,2018/15986515,2018,1,0,0,1,1,,0,,,,,A,1,1,1,0,fl:st_ln:perry-8,1,Stephen C. Perry,,,,,,,,,,,,,,,,,,,,,,,,,
10881126,2021,2019/16600063,2019,1,0,0,1,1,,0,,,,,A,1,1,1,0,fl:zh_ln:ci-1,1,Zhonghua Ci,,,,,,,,,,,,,,,,,,,,,,,,,
10881127,2021,2019/16653208,2019,1,1,1,1,1,"VINN SKINCARE, INC.",0,US,Los Angeles,CA,Los Angeles,A B,1,1,1,0,fl:ja_ln:mun-7,1,Jae-Choel MUN,,,,,,,,,,,,,,,,,,,,,,,,,0
10881128,2021,2015/15519210,2015,1,1,1,1,1,"ZUMEX GROUP, S.A.",0,ES,Herrera del Duque,,,A,1,1,1,0,fl:an_ln:flotatsmolinas-1,1,Antonio Flotats Molinas,,,,,,,,,,,,,,,,,,,,,,,,,0
10881129,2021,2017/15673893,2017,1,1,1,1,1,WISCONSIN ALUMNI RESEARCH FOUNDATION,0,US,Madison,WI,Dane,A C,2,2,2,0,fl:jo_ln:sand-1,1,Jordan Marshall Sand,fl:ma_ln:cook-19,1,Mark E. Cook,,,,,,,,,,,,,,,,,,,,,,0
10881130,2021,2019/16395669,2019,1,1,1,1,1,ALTRIA CLIENT SERVICES LLC,0,US,Richmond,VA,Richmond city,A B,2,2,2,0,fl:gr_ln:griscik-2,1,Gregory James Griscik,fl:ca_ln:miller-10,1,Carl Gregory Miller,,,,,,,,,,,,,,,,,,,,,,0
10881131,2021,2017/15590385,2017,1,1,1,1,1,JAPAN TOBACCO INC.,0,JP,Tokyo,,,A H,6,5,4,1,fl:hi_ln:matsumoto-77,,Hirofumi Matsumoto,fl:ak_ln:suzuki-21,0,Akihiko Suzuki,fl:ma_ln:takeuchi-50,1,Manabu Takeuchi,fl:ta_ln:nakano-27,1,Takuma NAKANO,fl:ma_ln:tarora-1,1,Masafumi Tarora,fl:ma_ln:yamada-28,1,Manabu Yamada,,,,,,,,,,0
10881132,2021,2011/13325765,2011,1,1,1,1,1,R. J. REYNOLDS TOBACCO COMPANY,0,US,Winston-Salem,NC,Forsyth County,A,2,1,1,0,fl:jo_ln:mua-1,1,John-Paul Mua,fl:er_ln:hunt-2,,Eric Taylor Hunt,,,,,,,,,,,,,,,,,,,,,,0
10881133,2021,2015/14688522,2015,1,1,1,1,1,R. J. REYNOLDS TOBACCO COMPANY,0,US,Winston-Salem,NC,Forsyth County,A C,4,4,4,0,fl:mi_ln:dube-5,1,Michael Francis Dube,fl:rh_ln:dale-1,1,Rhys Thomas Dale,fl:mo_ln:dale-1,1,Morrison Clark Dale,fl:je_ln:johnston-1,1,Jessica Hanna Johnston,,,,,,,,,,,,,,,,0
10881134,2021,2018/16194787,2018,1,1,1,1,1,ALTRIA CLIENT SERVICES LLC,0,US,Richmond,VA,Richmond city,A,7,6,5,1,fl:mu_ln:mishra-3,,Munmaya K. Mishra,fl:ja_ln:flora-7,1,Jason Flora,fl:ge_ln:karles-1,1,Georgios D. Karles,fl:ch_ln:galopin-1,1,Christophe C. Galopin,fl:di_ln:gee-1,0,Diane L. Gee,fl:jo_ln:paine-3,1,"John B. Paine, III",fl:do_ln:fernandez-3,1,Douglas A. Fernandez,,,,,,,0
10881135,2021,2017/15809321,2017,1,1,1,1,1,"CREATIVE DESTRUCTION, LLC",0,US,Spokane,WA,Spokane,A B,1,1,1,0,fl:ro_ln:magnuson-7,1,Robert S Magnuson,,,,,,,,,,,,,,,,,,,,,,,,,0
10881136,2021,2019/16623769,2019,1,1,1,1,1,"CHINA TOBACCO YUNNAN INDUSTRIAL CO., LTD",0,CN,Kunming,,,A,8,4,4,0,fl:ti_ln:li-112,,Tinghua LI,fl:do_ln:zhu-8,,Donglai ZHU,fl:yi_ln:han-35,1,Yi Han,fl:sh_ln:li-343,1,Shoubo LI,fl:yo_ln:chen-11,1,Yongkuan Chen,fl:we_ln:zhao-41,1,Wei Zhao,fl:xi_ln:zhang-357,,Xia Zhang,fl:xi_ln:gong-21,,Xiaowei Gong,,,,0
10881137,2021,2017/15712705,2017,1,1,1,1,1,JAPAN TOBACCO INC.,0,JP,Tokyo,,,A,4,4,3,1,fl:ak_ln:suzuki-21,0,Akihiko Suzuki,fl:ma_ln:takeuchi-50,1,Manabu Takeuchi,fl:ta_ln:nakano-27,1,Takuma NAKANO,fl:ma_ln:yamada-28,1,Manabu Yamada,,,,,,,,,,,,,,,,0
10881138,2021,2013/14382198,2013,1,1,1,1,1,BRITISH AMERICAN TOBACCO (INVESTMENTS) LIMITED,0,GB,London,,,A H,2,2,1,1,fl:fo_ln:saleem-1,0,Fozia Saleem,fl:th_ln:woodman-1,1,Thomas Woodman,,,,,,,,,,,,,,,,,,,,,,0
10881139,2021,2016/15204272,2016,1,1,1,1,1,ALTRIA CLIENT SERVICES LLC,0,US,Richmond,VA,Richmond city,A,4,4,2,2,fl:sa_ln:li-15,1,San Li,fl:be_ln:ragland-1,1,Ben RAGLAND,fl:di_ln:gee-1,0,Diane L. Gee,fl:ra_ln:olegario-1,0,Raquel Olegario,,,,,,,,,,,,,,,,0
10881140,2021,2017/15623825,2017,1,1,1,1,1,ALTRIA CLIENT SERVICES LLC,0,US,Richmond,VA,Richmond city,A H,1,1,1,0,fl:fa_ln:duc-1,1,Fabien DUC,,,,,,,,,,,,,,,,,,,,,,,,,0
10881141,2021,2016/15739029,2016,1,1,1,1,1,NICOVENTURES HOLDINGS LIMITED,0,GB,London,,,A H,3,3,3,0,fl:ro_ln:fraser-20,1,Rory FRASER,fl:co_ln:dickens-1,1,Colin DICKENS,fl:si_ln:jain-1,1,Siddhartha Jain,,,,,,,,,,,,,,,,,,,0
10881142,2021,2016/15756529,2016,1,1,1,1,1,FONTEM HOLDINGS 1 B.V.,0,NL,Amsterdam,,,A,1,1,1,0,fl:li_ln:chaves-1,1,Liliana Chaves,,,,,,,,,,,,,,,,,,,,,,,,,0
10881143,2021,2017/15798640,2017,1,1,1,1,1,JAPAN TOBACCO INC.,0,JP,Tokyo,,,A H,3,3,2,1,fl:ak_ln:suzuki-21,0,Akihiko Suzuki,fl:ta_ln:nakano-27,1,Takuma NAKANO,fl:ma_ln:yamada-28,1,Manabu Yamada,,,,,,,,,,,,,,,,,,,0
10881144,2021,2017/15805382,2017,1,1,1,1,1,ALTRIA CLIENT SERVICES LLC,0,US,Richmond,VA,Richmond city,A,2,2,2,0,fl:ru_ln:batista-2,1,Rui Nuno Batista,fl:la_ln:manca-1,1,Laurent Manca,,,,,,,,,,,,,,,,,,,,,,0
10881145,2021,2018/15962143,2018,1,1,1,1,1,"SHENZHEN FIRST UNION TECHNOLOGY CO., LTD.",0,CN,Tangxia,,,A,5,3,3,0,fl:xi_ln:zhao-184,1,Xiaoqiang Zhao,fl:re_ln:wu-3,1,Renjin Wu,fl:yo_ln:li-52,,Yonghai Li,fl:zh_ln:xu-113,,Zhongli Xu,fl:ch_ln:dai-38,1,Changzheng Dai,,,,,,,,,,,,,0
10881146,2021,2018/15994283,2018,1,1,1,1,1,JOYETECH EUROPE HOLDING GMBH,0,CH,Zug,,,A,1,0,0,0,fl:we_ln:qiu-32,,Weihua Qiu,,,,,,,,,,,,,,,,,,,,,,,,,0