patent_number,grant_year,application_number,application_year,d_inventor,d_assignee,d_location,d_application,d_ipc,assignee,assignee_ind,country,city,state,county,ipc_section,team_size,inventors,men_inventors,women_inventors,inventor_id1,male_flag1,inventor_name1,inventor_id2,male_flag2,inventor_name2,inventor_id3,male_flag3,inventor_name3,inventor_id4,male_flag4,inventor_name4,inventor_id5,male_flag5,inventor_name5,inventor_id6,male_flag6,inventor_name6,inventor_id7,male_flag7,inventor_name7,inventor_id8,male_flag8,inventor_name8,inventor_id9,male_flag9,inventor_name9,assignee_sequence
3930271,,05/532875,1974,0,1,1,1,1,HI-KAHNG TRADING CO.,0,US,Chicago,IL,Cook County,A,,,,,,,,,,,,,,,,,,,,,,,,,,,,,,,,0
3930272,,05/501533,1974,0,1,1,1,1,HEDSTROM CORPORATION,0,US,Bedford,PA,Bedford,A,,,,,,,,,,,,,,,,,,,,,,,,,,,,,,,,0
3933099,,05/430404,1974,0,1,0,1,1,H. JUNGHEINRICH & CO.,0,,,,,B,,,,,,,,,,,,,,,,,,,,,,,,,,,,,,,,0
3933186,,05/421210,1973,0,1,1,1,1,THE DOW CHEMICAL COMPANY,0,US,Midland,MI,Midland County,B F,,,,,,,,,,,,,,,,,,,,,,,,,,,,,,,,0
3934407,,05/507802,1974,0,1,0,1,1,"WAFIOS, MASCHINENFABRIK, WAGNER, FICKER & SCHMID",0,,,,,B,,,,,,,,,,,,,,,,,,,,,,,,,,,,,,,,0
3935372,,05/494213,1974,0,1,1,1,1,BURROUGHS CORPORATION,0,US,Detroit,MI,Wayne,H,,,,,,,,,,,,,,,,,,,,,,,,,,,,,,,,0
3936438,,05/509752,1974,0,1,1,1,1,WARNER-LAMBERT COMPANY,0,US,Morristown,NJ,Morris,C,,,,,,,,,,,,,,,,,,,,,,,,,,,,,,,,0
3944291,,05/487677,1974,0,1,0,1,1,WABCO WESTINGHOUSE GMBH,0,,,,,B,,,,,,,,,,,,,,,,,,,,,,,,,,,,,,,,0
3944325,,05/465044,1974,0,1,1,1,1,OPTICAL RESEARCH AND DEVELOPMENT CORPORATION,0,US,Berkeley,CA,Alameda,G,,,,,,,,,,,,,,,,,,,,,,,,,,,,,,,,0
3944917,,05/387548,1973,0,1,1,1,1,"COULTER ELECTRONICS, INC.",0,US,Hialeah,FL,Miami-Dade,G,,,,,,,,,,,,,,,,,,,,,,,,,,,,,,,,0
3945812,,05/526636,1974,,,,1,1,,,,,,,B,,,,,,,,,,,,,,,,,,,,,,,,,,,,,,,,
3946513,,05/534872,1974,0,1,1,1,1,"GS INDUSTRIES, INC.",0,US,Oak Forest,IL,Cook,A,,,,,,,,,,,,,,,,,,,,,,,,,,,,,,,,0
3947957,,05/450323,1974,0,1,0,1,1,INTERNATIONAL COMPUTERS LIMITED,0,,,,,H,,,,,,,,,,,,,,,,,,,,,,,,,,,,,,,,0
3948245,,05/509141,1974,0,1,1,1,1,U.S. PHILIPS CORPORATION,0,US,New York,NY,New York County,F,,,,,,,,,,,,,,,,,,,,,,,,,,,,,,,,0
3949305,,05/543538,1975,0,1,1,1,1,"NARCO SCIENTIFIC INDUSTRIES, INC.",0,US,Fort Washington,PA,Montgomery,H,,,,,,,,,,,,,,,,,,,,,,,,,,,,,,,,0
3949878,,05/552416,1975,,,,1,1,,,,,,,B,,,,,,,,,,,,,,,,,,,,,,,,,,,,,,,,
3950616,,05/566609,1975,0,1,1,1,1,"BELL TELEPHONE LABORATORIES, INCORPORATED",0,US,New Providence,NJ,Union,H,,,,,,,,,,,,,,,,,,,,,,,,,,,,,,,,0
3957120,,05/553025,1975,,,,1,1,,,,,,,A,,,,,,,,,,,,,,,,,,,,,,,,,,,,,,,,
3962104,,05/482642,1974,0,1,1,1,1,EXXON RESEARCH AND ENGINEERING COMPANY,0,US,Linden,NJ,Union,C,,,,,,,,,,,,,,,,,,,,,,,,,,,,,,,,0
3963313,,05/611735,1975,0,1,1,1,1,HOFFMANN-LA ROCHE INC.,0,US,Nutley,NJ,Essex,G,,,,,,,,,,,,,,,,,,,,,,,,,,,,,,,,0
3964010,,05/513165,1974,,,,1,1,,,,,,,H,,,,,,,,,,,,,,,,,,,,,,,,,,,,,,,,
3965296,,02/542975,1944,0,1,1,1,1,"BELL TELEPHONE LABORATORIES, INCORPORATED",0,US,New Providence,NJ,Union,H,,,,,,,,,,,,,,,,,,,,,,,,,,,,,,,,0
3967152,,05/596323,1975,0,1,1,1,1,GTE LABORATORIES INCORPORATED,0,US,Waltham,MA,Middlesex,H,,,,,,,,,,,,,,,,,,,,,,,,,,,,,,,,0
3967989,,03/851935,1959,0,1,1,1,1,ROHM AND HAAS COMPANY,0,US,Philadelphia,PA,Philadelphia,C,,,,,,,,,,,,,,,,,,,,,,,,,,,,,,,,0
3975091,,05/570149,1975,0,1,0,1,1,ASAHI KOGAKU KOGYO KABUSHIKI KAISHA,0,,,,,G,,,,,,,,,,,,,,,,,,,,,,,,,,,,,,,,0
3976181,,05/501123,1974,0,1,1,1,1,SCM CORPORATION,0,US,New York,NY,New York County,B,,,,,,,,,,,,,,,,,,,,,,,,,,,,,,,,0
3979936,,05/521144,1974,0,1,0,1,1,KRAFTWERK UNION AKTIENGESELLSCHAFT,0,,,,,B,,,,,,,,,,,,,,,,,,,,,,,,,,,,,,,,0
3981013,,04/576782,1966,0,1,1,1,1,THE UNITED STATES OF AMERICA AS REPRESENTED BY THE SECRETARY OF THE NAVY,0,US,Washington,DC,District of Columbia,G,,,,,,,,,,,,,,,,,,,,,,,,,,,,,,,,0
3986080,,05/529103,1974,0,1,0,1,1,"MATSUSHITA ELECTRIC INDUSTRIAL CO., LTD.",0,,,,,H,,,,,,,,,,,,,,,,,,,,,,,,,,,,,,,,0
3991417,,05/573782,1975,0,1,1,1,1,INTERNATIONAL TELEPHONE AND TELEGRAPH CORPORATION,0,US,New York,NY,New York County,G,,,,,,,,,,,,,,,,,,,,,,,,,,,,,,,,0
3993436,,05/523272,1974,0,1,0,1,1,"SHISEIDO COMPANY, LTD.",0,,,,,A,,,,,,,,,,,,,,,,,,,,,,,,,,,,,,,,0
3995353,,05/639296,1975,0,1,1,1,1,MORGAN CONSTRUCTION COMPANY,0,US,Worcester,MA,Worcester County,B,,,,,,,,,,,,,,,,,,,,,,,,,,,,,,,,0
4000162,,05/504215,1974,0,1,1,1,1,TEXACO INC.,0,US,New York,NY,New York County,C,,,,,,,,,,,,,,,,,,,,,,,,,,,,,,,,0
4000173,,05/249575,1972,0,1,0,1,1,BAYER AKTIENGESELLSCHAFT,0,,,,,C,,,,,,,,,,,,,,,,,,,,,,,,,,,,,,,,0
4003108,,05/603273,1975,,,,1,1,,,,,,,A,,,,,,,,,,,,,,,,,,,,,,,,,,,,,,,,
4003513,,05/607670,1975,0,1,0,1,1,INTERNATIONAL RESEARCH AND DEVELOPMENT CORPORATION,0,,,,,B,,,,,,,,,,,,,,,,,,,,,,,,,,,,,,,,0
4013895,,05/392372,1973,0,1,0,1,1,MITSUBISHI DENKI KABUSHIKI KAISHA,0,,,,,F,,,,,,,,,,,,,,,,,,,,,,,,,,,,,,,,0
4013965,,05/655556,1976,,,,1,1,,,,,,,H,,,,,,,,,,,,,,,,,,,,,,,,,,,,,,,,
4019690,,05/616253,1975,0,1,1,1,1,MASCHINENFABRIK RIETER AG,0,CH,Winterthur,,,B,,,,,,,,,,,,,,,,,,,,,,,,,,,,,,,,0
4028016,,05/645815,1975,0,1,1,1,1,GRASSO'S KONINKLIJKE MACHINEFABRIEKEN N.V.,0,NL,'s-Hertogenbosch,,,F,,,,,,,,,,,,,,,,,,,,,,,,,,,,,,,,0
4032488,,05/619178,1975,0,1,0,1,1,MEITO SANGYO KABUSHIKI KAISHA,0,,,,,C,,,,,,,,,,,,,,,,,,,,,,,,,,,,,,,,0
4033306,,05/585055,1975,0,1,0,1,1,"NISSAN MOTOR CO., LTD.",0,,,,,F,,,,,,,,,,,,,,,,,,,,,,,,,,,,,,,,0
4037354,,05/552643,1975,,,,1,1,,,,,,,A,,,,,,,,,,,,,,,,,,,,,,,,,,,,,,,,
4067650,,05/676633,1976,,,,1,1,,,,,,,G,,,,,,,,,,,,,,,,,,,,,,,,,,,,,,,,
4070017,,05/699270,1976,,,,1,1,,,,,,,A,,,,,,,,,,,,,,,,,,,,,,,,,,,,,,,,
4072514,,05/665115,1976,,,,1,1,,,,,,,C,,,,,,,,,,,,,,,,,,,,,,,,,,,,,,,,
4073378,,05/706612,1976,0,1,1,1,1,HARRINGTON MANUFACTURING COMPANY,0,US,Lasker,NC,Northampton,B,,,,,,,,,,,,,,,,,,,,,,,,,,,,,,,,0
4085811,,05/711368,1976,0,1,0,1,1,SARTORIUS-WERKE GMBH (UND VORM. GOTTINGER PRAZISIONSWAAGENFABRIK GMBH),0,,,,,G,,,,,,,,,,,,,,,,,,,,,,,,,,,,,,,,0
4085841,,05/792202,1977,0,1,1,1,1,GRAPHIC PACKAGING CORPORATION,0,US,Gardena,CA,Los Angeles,B,,,,,,,,,,,,,,,,,,,,,,,,,,,,,,,,0
4087084,,05/827179,1977,0,1,1,1,1,"LOUIS A. GRANT, INC.",0,US,Pittsburgh,PA,Allegheny,F,,,,,,,,,,,,,,,,,,,,,,,,,,,,,,,,0
4087595,,05/649373,1976,0,1,1,1,1,P. R. MALLORY & CO. INC.,0,US,Indianapolis,IN,Marion,H,,,,,,,,,,,,,,,,,,,,,,,,,,,,,,,,0
4088492,,05/412029,1973,0,1,0,1,1,IMPERIAL CHEMICAL INDUSTRIES PLC,0,,,,,G,,,,,,,,,,,,,,,,,,,,,,,,,,,,,,,,0
4097567,,5,1976,0,1,1,1,1,ALUMINUM COMPANY OF AMERICA,0,US,Pittsburgh,PA,Allegheny,C,,,,,,,,,,,,,,,,,,,,,,,,,,,,,,,,0
4122747,,05/817971,1977,0,1,1,1,1,NIPPON GAKKI SEIZO KABUSHIKI KAISHA,0,JP,Hamamatsu,,,G,,,,,,,,,,,,,,,,,,,,,,,,,,,,,,,,0
4136696,,05/729094,1976,0,1,1,1,1,INTERNATIONAL PAPER COMPANY,0,US,New York,NY,New York County,A,,,,,,,,,,,,,,,,,,,,,,,,,,,,,,,,0
4138861,,05/780692,1977,0,1,1,1,1,"INSTITUTE OF GAS TECHNOLOGY, A NONPROFIT CORPORATION",0,US,Chicago,IL,Cook County,F,,,,,,,,,,,,,,,,,,,,,,,,,,,,,,,,0
4140128,,05/815476,1977,,,,1,1,,,,,,,A,,,,,,,,,,,,,,,,,,,,,,,,,,,,,,,,
4144134,,05/764180,1977,0,1,1,1,1,VITATECT CORPORATION,0,US,Alexandria,VA,Alexandria city,C,,,,,,,,,,,,,,,,,,,,,,,,,,,,,,,,0
4156355,,05/935422,1978,0,1,1,1,1,THE SINGER COMPANY,0,US,New York,NY,New York County,D,,,,,,,,,,,,,,,,,,,,,,,,,,,,,,,,0
4165982,,05/858637,1977,0,1,1,1,1,DAIDO TOKUSHUKO KABUSHIKI KAISHA,0,JP,Nagoya,,,C,,,,,,,,,,,,,,,,,,,,,,,,,,,,,,,,0
4175793,,05/947970,1978,0,1,1,1,1,WESTINGHOUSE AIR BRAKE COMPANY,0,US,North Versailles,PA,Allegheny,B,,,,,,,,,,,,,,,,,,,,,,,,,,,,,,,,0
4178367,,05/878571,1978,0,1,1,1,1,"ONO PHARMACEUTICAL CO., LTD.",0,JP,Osaka,,,A C,,,,,,,,,,,,,,,,,,,,,,,,,,,,,,,,0
4178968,,05/801212,1977,0,1,1,1,1,PIRELLI TYRE S.P.A.,0,IT,Milano,,,B F,,,,,,,,,,,,,,,,,,,,,,,,,,,,,,,,0
4180938,,05/842664,1977,,,,1,1,,,,,,,A,,,,,,,,,,,,,,,,,,,,,,,,,,,,,,,,
4182257,,05/917080,1978,0,1,1,1,1,ERNO RAUMFAHRTTECHNIK GMBH,0,DE,Bremen,,,B,,,,,,,,,,,,,,,,,,,,,,,,,,,,,,,,0
4185400,,05/933146,1978,0,1,1,1,1,"SEARS, ROEBUCK AND CO.",0,US,Chicago,IL,Cook County,G,,,,,,,,,,,,,,,,,,,,,,,,,,,,,,,,0
4185942,,05/840183,1977,0,1,1,1,1,THE UNITED STATES OF AMERICA AS REPRESENTED BY THE ADMINISTRATOR OF THE NATIONAL AERONAUTICS AND SPACE ADMINISTRATION,0,US,Washington,DC,District of Columbia,B,,,,,,,,,,,,,,,,,,,,,,,,,,,,,,,,0
4186494,,05/883794,1978,0,1,1,1,1,SOCIETE NATIONALE ELF AQUITAINE (PRODUCTION),0,FR,Courbevoie,,,G,,,,,,,,,,,,,,,,,,,,,,,,,,,,,,,,0
4189706,,05/883571,1978,,,,1,1,,,,,,,B,,,,,,,,,,,,,,,,,,,,,,,,,,,,,,,,
4189960,,05/851648,1977,0,1,1,1,1,BORGWARNER INC.,0,US,Chicago,IL,Cook County,F,,,,,,,,,,,,,,,,,,,,,,,,,,,,,,,,0
4194344,,05/903793,1978,,,,1,1,,,,,,,A,,,,,,,,,,,,,,,,,,,,,,,,,,,,,,,,
4195309,,05/966512,1978,0,1,1,1,1,RCA CORPORATION,0,US,New York,NY,New York County,H,,,,,,,,,,,,,,,,,,,,,,,,,,,,,,,,0
4197134,,06/003233,1979,0,1,1,1,1,BATTENFELD GREASE & OIL CORP. OF NEW YORK,0,US,North Tonawanda,NY,Niagara,C,,,,,,,,,,,,,,,,,,,,,,,,,,,,,,,,0
4202360,,05/897809,1978,0,1,1,1,1,CLAIROL INCORPORATED,0,US,New York,NY,New York County,A,,,,,,,,,,,,,,,,,,,,,,,,,,,,,,,,0
4205102,,05/855988,1977,0,1,1,1,1,AKZO N.V.,0,NL,,,,B,,,,,,,,,,,,,,,,,,,,,,,,,,,,,,,,0
4205416,,05/881536,1978,,,,1,1,,,,,,,A,,,,,,,,,,,,,,,,,,,,,,,,,,,,,,,,
4205776,,06/016960,1979,0,1,1,1,1,REFEKA WERBEMITTEL GMBH,0,DE,Heimstetten,,,B,,,,,,,,,,,,,,,,,,,,,,,,,,,,,,,,0
4209225,,06/003105,1979,0,1,1,1,1,KONAN CAMERA RESEARCH INSTITUTE,0,JP,Kobe,,,A G,,,,,,,,,,,,,,,,,,,,,,,,,,,,,,,,0
4210425,,05/836890,1977,0,1,1,1,1,TEXACO INC.,0,US,White Plains,NY,Westchester,C,,,,,,,,,,,,,,,,,,,,,,,,,,,,,,,,0
4211277,,05/908696,1978,0,1,1,1,1,SULZER BROTHERS LIMITED,0,CH,Winterthur,,,F,,,,,,,,,,,,,,,,,,,,,,,,,,,,,,,,0
4215298,,05/916299,1978,0,1,1,1,1,"LOCKHEED ELECTRONICS CO., INC.",0,US,Plainfield,NJ,Union,H,,,,,,,,,,,,,,,,,,,,,,,,,,,,,,,,0
4221373,,05/888199,1978,0,1,1,1,1,GRAPHA-HOLDING AG,0,CH,Hergiswil,,,B,,,,,,,,,,,,,,,,,,,,,,,,,,,,,,,,0
4221951,,05/949640,1978,,,,1,1,,,,,,,B,,,,,,,,,,,,,,,,,,,,,,,,,,,,,,,,
4223785,,06/044204,1979,,,,1,1,,,,,,,A,,,,,,,,,,,,,,,,,,,,,,,,,,,,,,,,
4227066,,06/011314,1979,,,,1,1,,,,,,,B,,,,,,,,,,,,,,,,,,,,,,,,,,,,,,,,
4231282,,06/025176,1979,0,1,1,1,1,GENERAL ELECTRIC COMPANY,0,US,Burlington,VT,Chittenden,F,,,,,,,,,,,,,,,,,,,,,,,,,,,,,,,,0
4241242,,06/003622,1979,,,,1,1,,,,,,,H,,,,,,,,,,,,,,,,,,,,,,,,,,,,,,,,
4251534,,05/863269,1977,0,1,1,1,1,E. I. DU PONT DE NEMOURS AND COMPANY,0,US,Wilmington,DE,New Castle,A C,,,,,,,,,,,,,,,,,,,,,,,,,,,,,,,,0
4252262,,05/939270,1978,,,,1,1,,,,,,,A,,,,,,,,,,,,,,,,,,,,,,,,,,,,,,,,
4256091,,06/032907,1979,,,,1,1,,,,,,,F,,,,,,,,,,,,,,,,,,,,,,,,,,,,,,,,
4256615,,06/036359,1979,0,1,1,1,1,"SYNTHETIC SURFACES, INC.",0,US,Scotch Plains,NJ,Union,C,,,,,,,,,,,,,,,,,,,,,,,,,,,,,,,,0
4258632,,05/972920,1978,0,1,1,1,1,ROLLAND MIVILLE,1,CA,LaSalle,ON,,E,,,,,,,,,,,,,,,,,,,,,,,,,,,,,,,,0
4259477,,06/045151,1979,0,1,1,1,1,"MERCK & CO., INC.",0,US,Rahway,NJ,Union,C,,,,,,,,,,,,,,,,,,,,,,,,,,,,,,,,0
4262266,,06/081273,1979,0,1,1,1,1,CALIFORNIA INSTITUTE OF TECHNOLOGY,0,US,Pasadena,CA,Los Angeles,H,,,,,,,,,,,,,,,,,,,,,,,,,,,,,,,,0
4266356,,06/016078,1979,,,,1,1,,,,,,,F,,,,,,,,,,,,,,,,,,,,,,,,,,,,,,,,
4267109,,05/929160,1978,0,1,1,1,1,ARGUS CHEMICAL CORPORATION,0,US,Oneonta,NY,Otsego,C,,,,,,,,,,,,,,,,,,,,,,,,,,,,,,,,0
4273141,,05/886399,1978,,,,1,1,,,,,,,A,,,,,,,,,,,,,,,,,,,,,,,,,,,,,,,,
4275391,,06/010489,1979,0,1,1,1,1,"HONDA LOCK MFG. CO., LTD.",0,JP,Miyazaki,,,G,,,,,,,,,,,,,,,,,,,,,,,,,,,,,,,,0
4278676,,05/917118,1978,0,1,1,1,1,H. LUNDBECK A/S,0,DK,Copenhagen,,,A C,,,,,,,,,,,,,,,,,,,,,,,,,,,,,,,,0
4288794,,06/106285,1979,0,1,1,1,1,TEXTRON INC.,0,US,Providence,RI,Providence County,H,,,,,,,,,,,,,,,,,,,,,,,,,,,,,,,,0
4296010,,06/116780,1980,0,1,1,1,1,"KANSAI PAINT CO., LTD.",0,JP,Kasai,,,C,,,,,,,,,,,,,,,,,,,,,,,,,,,,,,,,0
4296400,,05/964431,1978,0,1,1,1,1,SIEMENS AKTIENGESELLSCHAFT,0,DE,Munich,,,G,,,,,,,,,,,,,,,,,,,,,,,,,,,,,,,,0
4299241,,05/896393,1978,,,,1,1,,,,,,,A,,,,,,,,,,,,,,,,,,,,,,,,,,,,,,,,
4300836,,06/086725,1979,0,1,1,1,1,OREGON GRADUATE CENTER,0,US,Beaverton,OR,Washington,G,,,,,,,,,,,,,,,,,,,,,,,,,,,,,,,,0
4301984,,05/972150,1978,0,1,1,1,1,THE BOEING COMPANY,0,US,Seattle,WA,King,B,,,,,,,,,,,,,,,,,,,,,,,,,,,,,,,,0
4310254,,06/125918,1980,0,1,1,1,1,CUV PROGRESS,0,BG,Sofia,,,B,,,,,,,,,,,,,,,,,,,,,,,,,,,,,,,,0
4317695,,06/210703,1980,0,1,1,1,1,"WESTERN ELECTRIC COMPANY, INC.",0,US,New York,NY,New York County,B,,,,,,,,,,,,,,,,,,,,,,,,,,,,,,,,0
4318293,,06/051350,1979,0,1,1,1,1,HEGENSCHEIDT-MFD GMBH & CO. KG,0,DE,Erkelenz,,,B,,,,,,,,,,,,,,,,,,,,,,,,,,,,,,,,0
4319659,,06/117832,1980,,,,1,1,,,,,,,B E,,,,,,,,,,,,,,,,,,,,,,,,,,,,,,,,
4323030,,06/160680,1980,,,,1,1,,,,,,,B,,,,,,,,,,,,,,,,,,,,,,,,,,,,,,,,
4324740,,06/240394,1981,0,1,1,1,1,HENKEL AG & CO. KGAA,0,DE,Hilden,,,C,,,,,,,,,,,,,,,,,,,,,,,,,,,,,,,,0
4328038,,06/206508,1980,0,1,1,1,1,BJ-HUGHES INC.,0,US,Houston,TX,Harris County,C,,,,,,,,,,,,,,,,,,,,,,,,,,,,,,,,0
4328070,,06/126332,1980,,,,1,1,,,,,,,G,,,,,,,,,,,,,,,,,,,,,,,,,,,,,,,,
4335705,,06/165004,1980,,,,1,1,,,,,,,F,,,,,,,,,,,,,,,,,,,,,,,,,,,,,,,,
4337002,,06/140758,1980,,,,1,1,,,,,,,B,,,,,,,,,,,,,,,,,,,,,,,,,,,,,,,,
4338685,,06/155552,1980,,,,1,1,,,,,,,A,,,,,,,,,,,,,,,,,,,,,,,,,,,,,,,,
4344299,,06/156567,1980,,,,1,1,,,,,,,F,,,,,,,,,,,,,,,,,,,,,,,,,,,,,,,,
4352223,,06/189848,1980,0,1,1,1,1,MASCHINENFABRIK RIETER AG,0,CH,Winterthur,,,D,,,,,,,,,,,,,,,,,,,,,,,,,,,,,,,,0
4354158,,06/076383,1979,0,1,1,1,1,SIEMENS AKTIENGESELLSCHAFT,0,DE,Munich,,,H,,,,,,,,,,,,,,,,,,,,,,,,,,,,,,,,0
4358803,,06/135804,1980,0,1,1,1,1,U.S. PHILIPS CORPORATION,0,US,New York,NY,New York County,G,,,,,,,,,,,,,,,,,,,,,,,,,,,,,,,,0
4360236,,06/132844,1980,0,1,1,1,1,"FIRMA G.B. BOUCHERIE, NAAMLOZE VENNOOTSCHAP",0,BE,Izegem,,,A,,,,,,,,,,,,,,,,,,,,,,,,,,,,,,,,0
4361523,,06/257441,1981,0,1,1,1,1,B. D. WAIT CO. LIMITED,0,CA,Oakville,ON,,B,,,,,,,,,,,,,,,,,,,,,,,,,,,,,,,,0
4365091,,06/317335,1981,0,1,1,1,1,"SUMITOMO CHEMICAL COMPANY, LIMITED",0,JP,Osaka,,,C,,,,,,,,,,,,,,,,,,,,,,,,,,,,,,,,0
4375001,,06/156432,1980,,,,1,1,,,,,,,C,,,,,,,,,,,,,,,,,,,,,,,,,,,,,,,,
4375071,,06/198750,1980,0,1,1,1,1,AMP INCORPORATED,0,US,Harrisburg,PA,Dauphin,G,,,,,,,,,,,,,,,,,,,,,,,,,,,,,,,,0
4376769,,06/275166,1981,0,1,1,1,1,SCHERING CORPORATION,0,US,Kenilworth,NJ,Union,A C,,,,,,,,,,,,,,,,,,,,,,,,,,,,,,,,0
4378490,,06/208001,1980,0,1,1,1,1,THOMSON-CSF,0,FR,Paris,,,G,,,,,,,,,,,,,,,,,,,,,,,,,,,,,,,,0
4386894,,06/338287,1982,,,,1,1,,,,,,,F,,,,,,,,,,,,,,,,,,,,,,,,,,,,,,,,
4387548,,06/184787,1980,0,1,1,1,1,"LANTECH, INC.",0,US,Louisville,KY,Jefferson,B,,,,,,,,,,,,,,,,,,,,,,,,,,,,,,,,0
4389745,,06/262665,1981,0,1,1,1,1,INTERNATIONAL SHOE MACHINE CORPORATION,0,US,Nashua,NH,Hillsborough,A,,,,,,,,,,,,,,,,,,,,,,,,,,,,,,,,0
4391996,,06/321644,1981,0,1,1,1,1,GENERAL ELECTRIC COMPANY,0,US,Schenectady,NY,Schenectady County,C,,,,,,,,,,,,,,,,,,,,,,,,,,,,,,,,0
4393555,,06/250039,1981,0,1,1,1,1,REPA FEINSTANZWERK GMBH,0,DE,Alfdorf,,,A,,,,,,,,,,,,,,,,,,,,,,,,,,,,,,,,0
4394630,,06/306519,1981,0,1,1,1,1,GENERAL ELECTRIC COMPANY,0,US,Syracuse,NY,Onondaga,H,,,,,,,,,,,,,,,,,,,,,,,,,,,,,,,,0
4399302,,06/352451,1982,0,1,1,1,1,DEGUSSA AG,0,DE,Frankfurt,,,C,,,,,,,,,,,,,,,,,,,,,,,,,,,,,,,,0
4402764,,06/351341,1982,0,1,1,1,1,"TURBINE METAL TECHNOLOGY, INC.",0,US,Burbank,CA,Los Angeles,C,,,,,,,,,,,,,,,,,,,,,,,,,,,,,,,,0
4402938,,06/276230,1981,0,1,1,1,1,"IMPRO PRODUCTS, INC.",0,US,Waukon,IA,Allamakee,A,,,,,,,,,,,,,,,,,,,,,,,,,,,,,,,,0
4409910,,06/387330,1982,0,1,1,1,1,THE REGENTS OF THE UNIVERSITY OF CALIFORNIA,0,US,Berkeley,CA,Alameda,A,,,,,,,,,,,,,,,,,,,,,,,,,,,,,,,,0
4416187,,06/233130,1981,,,,1,1,,,,,,,F,,,,,,,,,,,,,,,,,,,,,,,,,,,,,,,,
4423300,,06/352504,1982,0,1,1,1,1,EECO INCORPORATED,0,US,Santa Ana,CA,Orange,H,,,,,,,,,,,,,,,,,,,,,,,,,,,,,,,,0
4424580,,6,1981,0,1,1,1,1,EXCEL PRECISION CORPORATION,0,US,Santa Clara,CA,Santa Clara,G,,,,,,,,,,,,,,,,,,,,,,,,,,,,,,,,0
4427390,,06/315190,1981,,,,1,1,,,,,,,G,,,,,,,,,,,,,,,,,,,,,,,,,,,,,,,,
4430489,,06/372587,1982,0,1,1,1,1,THIOKOL CORPORATION,0,US,Chicago,IL,Cook County,C,,,,,,,,,,,,,,,,,,,,,,,,,,,,,,,,0
4433462,,06/322024,1981,,,,1,1,,,,,,,B,,,,,,,,,,,,,,,,,,,,,,,,,,,,,,,,
4435593,,06/430340,1982,0,1,1,1,1,THE STANDARD OIL COMPANY,0,US,Chicago,IL,Cook County,C,,,,,,,,,,,,,,,,,,,,,,,,,,,,,,,,0
4435965,,06/337856,1982,0,1,1,1,1,CIBA-GEIGY CORPORATION,0,US,Ardsley,NY,Westchester,D,,,,,,,,,,,,,,,,,,,,,,,,,,,,,,,,0
4440894,,06/433389,1982,0,1,1,1,1,"DESOTO, INC.",0,US,Des Plaines,IL,Cook,C,,,,,,,,,,,,,,,,,,,,,,,,,,,,,,,,0
4447247,,06/290810,1981,,,,1,1,,,,,,,E,,,,,,,,,,,,,,,,,,,,,,,,,,,,,,,,
4447340,,06/391041,1982,0,1,1,1,1,COMPAGNIE FRANCAISE DES PETROLES,0,FR,Paris,,,C,,,,,,,,,,,,,,,,,,,,,,,,,,,,,,,,0
4448519,,06/388734,1982,0,1,1,1,1,"MITA INDUSTRIAL CO., LTD.",0,JP,Osaka,,,G,,,,,,,,,,,,,,,,,,,,,,,,,,,,,,,,0
4449534,,06/253801,1981,,,,1,1,,,,,,,A,,,,,,,,,,,,,,,,,,,,,,,,,,,,,,,,
4450289,,06/380640,1982,0,1,1,1,1,SHELL OIL COMPANY,0,US,Houston,TX,Harris County,C,,,,,,,,,,,,,,,,,,,,,,,,,,,,,,,,0
4451163,,06/394077,1982,0,1,1,1,1,THE GARRETT CORPORATION,0,US,Los Angeles,CA,Los Angeles,F,,,,,,,,,,,,,,,,,,,,,,,,,,,,,,,,0
4451939,,06/226813,1981,,,,1,1,,,,,,,A,,,,,,,,,,,,,,,,,,,,,,,,,,,,,,,,
4453246,,06/431853,1982,0,1,1,1,1,EASTMAN KODAK COMPANY,0,US,Rochester,NY,Monroe,G,,,,,,,,,,,,,,,,,,,,,,,,,,,,,,,,0
4453416,,06/331057,1981,0,1,1,1,1,THE BABCOCK & WILCOX COMPANY,0,US,New Orleans,LA,Orleans,G,,,,,,,,,,,,,,,,,,,,,,,,,,,,,,,,0
4455349,,06/516506,1983,0,1,1,1,1,ALLIED CORPORATION,0,US,Morristown,NJ,Morris,C D,,,,,,,,,,,,,,,,,,,,,,,,,,,,,,,,0
4455916,,06/350920,1982,0,1,1,1,1,THE UNITED STATES OF AMERICA AS REPRESENTED BY THE SECRETARY OF THE NAVY,0,US,Washington,DC,District of Columbia,F,,,,,,,,,,,,,,,,,,,,,,,,,,,,,,,,0
4456283,,06/260425,1981,0,1,1,1,1,METALLWERK MAX BROSE GMBH & CO.,0,DE,Coburg,,,B,,,,,,,,,,,,,,,,,,,,,,,,,,,,,,,,0
4456538,,06/323226,1981,0,1,1,1,1,THE LUBRIZOL CORPORATION,0,US,Wickliffe,OH,Lake,C,,,,,,,,,,,,,,,,,,,,,,,,,,,,,,,,0
4456662,,06/386265,1982,0,1,1,1,1,DEGUSSA AG,0,DE,Frankfurt am Main,,,B,,,,,,,,,,,,,,,,,,,,,,,,,,,,,,,,0
4457909,,06/424188,1982,,,,1,1,,,,,,,A,,,,,,,,,,,,,,,,,,,,,,,,,,,,,,,,
4459293,,06/489635,1983,0,1,1,1,1,AMERICAN CYANAMID COMPANY,0,US,Stamford,CT,Fairfield,A,,,,,,,,,,,,,,,,,,,,,,,,,,,,,,,,0
4462937,,06/243205,1981,0,1,1,1,1,RHONE-POULENC INDUSTRIES,0,FR,Paris,,,C,,,,,,,,,,,,,,,,,,,,,,,,,,,,,,,,0
4463530,,06/317320,1981,0,1,1,1,1,TRUBE & KINGS KG,0,DE,Cologne,,,E,,,,,,,,,,,,,,,,,,,,,,,,,,,,,,,,0
4466186,,06/253498,1981,,,,1,1,,,,,,,B,,,,,,,,,,,,,,,,,,,,,,,,,,,,,,,,
4468395,,06/380326,1982,0,1,1,1,1,SCHERING CORPORATION,0,DE,Bergkamen,,,A C,,,,,,,,,,,,,,,,,,,,,,,,,,,,,,,,0
4471771,,06/331914,1981,,,,1,1,,,,,,,A,,,,,,,,,,,,,,,,,,,,,,,,,,,,,,,,
4477871,,06/330050,1981,0,1,1,1,1,"MOTOROLA, INC.",0,US,Schaumburg,IL,Cook County,G,,,,,,,,,,,,,,,,,,,,,,,,,,,,,,,,0
4479207,,06/359794,1982,0,1,1,1,1,"HARTMAN MATERIAL HANDLING SYSTEMS, INC.",0,US,Victor,NY,Victor Town,G,,,,,,,,,,,,,,,,,,,,,,,,,,,,,,,,0
4480390,,06/419675,1982,0,1,1,1,1,ALLIED CORPORATION,0,US,Morristown,NJ,Morris,G,,,,,,,,,,,,,,,,,,,,,,,,,,,,,,,,0
4486381,,06/368436,1982,0,1,1,1,1,TOKYO SHIBAURA DENKI KABUSHIKI KAISHA,0,JP,Kawasaki,,,G,,,,,,,,,,,,,,,,,,,,,,,,,,,,,,,,0
4487593,,06/317608,1981,0,1,1,1,1,LOHR & BROMKAMP GMBH,0,US,,KS,Decatur County,F,,,,,,,,,,,,,,,,,,,,,,,,,,,,,,,,0
4491441,,06/541557,1983,0,1,1,1,1,DOWTY MINING EQUIPMENT LIMITED,0,GB,,,,E,,,,,,,,,,,,,,,,,,,,,,,,,,,,,,,,0
4493044,,06/355968,1982,0,1,1,1,1,"TEKTRONIX, INC.",0,US,Beaverton,OR,Washington,G,,,,,,,,,,,,,,,,,,,,,,,,,,,,,,,,0
4497835,,06/456986,1983,0,1,1,1,1,ALBERTA GAS CHEMICALS LTD.,0,US,Parsippany,NJ,Morris,A,,,,,,,,,,,,,,,,,,,,,,,,,,,,,,,,0
4500523,,06/597876,1984,0,1,1,1,1,"CORNELL RESEARCH FOUNDATION, INC.",0,US,Ithaca,NY,Ithaca Town,A,,,,,,,,,,,,,,,,,,,,,,,,,,,,,,,,0
4504630,,06/305866,1981,0,1,1,1,1,"PPG INDUSTRIES OHIO, INC.",0,US,Pittsburgh,PA,Allegheny,C,,,,,,,,,,,,,,,,,,,,,,,,,,,,,,,,0
4505578,,06/551266,1983,0,1,1,1,1,DIGITAL OPTICS CORPORATION,0,US,Sunnyvale,CA,Santa Clara,G H,,,,,,,,,,,,,,,,,,,,,,,,,,,,,,,,0
4506917,,06/400985,1982,0,1,1,1,1,"INTERFIT, INC.",0,US,Norristown,PA,Montgomery,F,,,,,,,,,,,,,,,,,,,,,,,,,,,,,,,,0
4517391,,06/496573,1983,0,1,1,1,1,BASF AKTIENGESELLSCHAFT,0,DE,Ludwigshafen,,,C,,,,,,,,,,,,,,,,,,,,,,,,,,,,,,,,0
4519506,,06/407541,1982,0,1,1,1,1,INTERNATIONALE OCTROOI MAATSCHAPPIJ OCTROPA B.V.,0,NL,Rotterdam,,,B,,,,,,,,,,,,,,,,,,,,,,,,,,,,,,,,0
4520171,,06/375260,1982,0,1,1,1,1,HERCULES INCORPORATED,0,US,Wilmington,DE,New Castle,C,,,,,,,,,,,,,,,,,,,,,,,,,,,,,,,,0
4521510,,06/567890,1984,0,1,1,1,1,E. I. DU PONT DE NEMOURS AND COMPANY,0,US,Wilmington,DE,New Castle,A C G,,,,,,,,,,,,,,,,,,,,,,,,,,,,,,,,0
4524573,,06/579356,1984,,,,1,1,,,,,,,A,,,,,,,,,,,,,,,,,,,,,,,,,,,,,,,,
4537991,,06/556680,1983,0,1,1,1,1,MOBAY CHEMICAL CORPORATION,0,US,Pittsburgh,PA,Allegheny,C,,,,,,,,,,,,,,,,,,,,,,,,,,,,,,,,0
4543410,,06/390179,1982,0,1,1,1,1,"MORCA, INC.",0,US,Pennington,NJ,Mercer,A B,,,,,,,,,,,,,,,,,,,,,,,,,,,,,,,,0
4546009,,06/148403,1980,,,,1,1,,,,,,,B H,,,,,,,,,,,,,,,,,,,,,,,,,,,,,,,,
4548459,,06/646653,1984,0,1,1,1,1,AMP INCORPORATED,0,US,Harrisburg,PA,Dauphin,H,,,,,,,,,,,,,,,,,,,,,,,,,,,,,,,,0
4549336,,06/608539,1984,0,1,1,1,1,MOSTEK CORPORATION,0,US,Carrollton,TX,Dallas County,H,,,,,,,,,,,,,,,,,,,,,,,,,,,,,,,,0
4551297,,06/646126,1984,0,1,1,1,1,J. H. BENECKE GMBH,0,DE,,,,B,,,,,,,,,,,,,,,,,,,,,,,,,,,,,,,,0
4552034,,06/464714,1983,0,1,1,1,1,ELESA S.P.A.,0,IT,Milano,,,G,,,,,,,,,,,,,,,,,,,,,,,,,,,,,,,,0
4553971,,06/568200,1983,0,1,1,1,1,METAL BOX LIMITED,0,GB,Reading,,,A,,,,,,,,,,,,,,,,,,,,,,,,,,,,,,,,0
4558711,,06/626827,1984,0,1,1,1,1,GLORY LTD.,0,JP,Kasai,,,G,,,,,,,,,,,,,,,,,,,,,,,,,,,,,,,,0
4565066,,06/500065,1983,,,,1,1,,,,,,,F,,,,,,,,,,,,,,,,,,,,,,,,,,,,,,,,
4566304,,06/458958,1983,0,1,1,1,1,VAN MARK PRODUCTS CORPORATION,0,US,Farmington Hills,MI,Oakland,B,,,,,,,,,,,,,,,,,,,,,,,,,,,,,,,,0
4567047,,06/597557,1984,,,,1,1,,,,,,,A,,,,,,,,,,,,,,,,,,,,,,,,,,,,,,,,
4580980,,06/685558,1984,,,,1,1,,,,,,,A,,,,,,,,,,,,,,,,,,,,,,,,,,,,,,,,
4581452,,06/526880,1983,0,1,1,1,1,SAGAMI CHEMICAL RESEARCH CENTER,0,JP,Tokyo,,,C,,,,,,,,,,,,,,,,,,,,,,,,,,,,,,,,0
4583251,,06/551877,1983,,,,1,1,,,,,,,A,,,,,,,,,,,,,,,,,,,,,,,,,,,,,,,,
4592425,,06/665555,1984,,,,1,1,,,,,,,E,,,,,,,,,,,,,,,,,,,,,,,,,,,,,,,,
4594367,,06/718441,1985,0,1,1,1,1,BATA LIMITED,0,CA,Schreiber,ON,,A C,,,,,,,,,,,,,,,,,,,,,,,,,,,,,,,,0
4594437,,06/703694,1985,0,1,1,1,1,UC UNITAS CORPORATION,0,US,New York,NY,New York County,C,,,,,,,,,,,,,,,,,,,,,,,,,,,,,,,,0
4603618,,06/735550,1985,,,,1,1,,,,,,,F,,,,,,,,,,,,,,,,,,,,,,,,,,,,,,,,
4605483,,06/668701,1984,,,,1,1,,,,,,,C,,,,,,,,,,,,,,,,,,,,,,,,,,,,,,,,
4606622,,06/570589,1984,0,1,1,1,1,"CARL-ZEISS-STIFTUNG, HEIDENHEIM/BRENZ",0,DE,Oberkochen,,,G,,,,,,,,,,,,,,,,,,,,,,,,,,,,,,,,0
4611699,,06/639396,1984,0,1,1,1,1,KABUSHIKI KAISHA DAIKIN SEISAKUSHO,0,JP,Osaka,,,B,,,,,,,,,,,,,,,,,,,,,,,,,,,,,,,,0
4613123,,06/611692,1984,0,1,1,1,1,THE SINGER COMPANY,0,US,Stamford,CT,Fairfield,B,,,,,,,,,,,,,,,,,,,,,,,,,,,,,,,,0
4620989,,06/650327,1984,0,1,1,1,1,"JOHANN STIEGLER KG, GMBH & CO.",0,DE,Solnhofen,,,B C,,,,,,,,,,,,,,,,,,,,,,,,,,,,,,,,0
4621625,,06/688076,1984,,,,1,1,,,,,,,A,,,,,,,,,,,,,,,,,,,,,,,,,,,,,,,,
4623540,,06/281818,1981,0,1,1,1,1,LABORATOIRE DE CHIMIE DES POLYMERES ORGANIQUES,0,FR,,,,A,,,,,,,,,,,,,,,,,,,,,,,,,,,,,,,,0
4625991,,06/727703,1985,0,1,1,1,1,TMC CORPORATION,0,CH,Baar,,,A,,,,,,,,,,,,,,,,,,,,,,,,,,,,,,,,0
4628976,,06/746725,1985,,,,1,1,,,,,,,B,,,,,,,,,,,,,,,,,,,,,,,,,,,,,,,,
4635317,,06/720677,1985,0,1,1,1,1,STORK PMT B.V.,0,NL,Boxmeer,,,A,,,,,,,,,,,,,,,,,,,,,,,,,,,,,,,,0
4636278,,06/811373,1985,0,1,1,1,1,LABELETTE COMPANY,0,US,Forest Park,IL,Cook,B,,,,,,,,,,,,,,,,,,,,,,,,,,,,,,,,0
4638935,,06/416859,1982,0,1,1,1,1,"DATA MOTION, INC.",0,US,Torrington,CT,Litchfield,B,,,,,,,,,,,,,,,,,,,,,,,,,,,,,,,,0
4639986,,06/249802,1981,0,1,1,1,1,PHILLIPS PETROLEUM COMPANY,0,US,Bartlesville,OK,Washington County,D,,,,,,,,,,,,,,,,,,,,,,,,,,,,,,,,0
4644691,,06/743564,1985,0,1,1,1,1,MEGICA CORPORATION,0,US,Rockford,IL,Winnebago County,E,,,,,,,,,,,,,,,,,,,,,,,,,,,,,,,,0